Detailed error log from "make test" on FreeBSD 8-current/amd64

Contents

sage -t "devel/sage/sage/schemes/elliptic_curves/lseries_ell.py"

System ran out of swap.

*** *** Error: TIMED OUT! PROCESS KILLED! *** ***
*** *** Error: TIMED OUT! *** ***
*** *** Error: TIMED OUT! *** ***
         [403.2 s]

sage -t "devel/sage/sage/schemes/elliptic_curves/ell_rational_field.py"

**********************************************************************
File "/home/peter/sage/sage-3.4/devel/sage/sage/schemes/elliptic_curves/ell_rational_field.py", line 1178:
    sage: E.analytic_rank(algorithm='sympow')
Exception raised:
    Traceback (most recent call last):
      File "/home/peter/sage/sage-3.4/local/bin/ncadoctest.py", line 1231, in run_one_test
        self.run_one_example(test, example, filename, compileflags)
      File "/home/peter/sage/sage-3.4/local/bin/sagedoctest.py", line 38, in run_one_example
        OrigDocTestRunner.run_one_example(self, test, example, filename, compileflags)
      File "/home/peter/sage/sage-3.4/local/bin/ncadoctest.py", line 1172, in run_one_example
        compileflags, 1) in test.globs
      File "<doctest __main__.example_27[5]>", line 1, in <module>
        E.analytic_rank(algorithm='sympow')###line 1178:
    sage: E.analytic_rank(algorithm='sympow')
      File "/home/peter/sage/sage-3.4/local/lib/python2.5/site-packages/sage/schemes/elliptic_curves/ell_rational_field.py", line 1208, in analytic_rank
        return sympow.analytic_rank(self)[0]
      File "/home/peter/sage/sage-3.4/local/lib/python2.5/site-packages/sage/lfunctions/sympow.py", line 287, in analytic_rank
        raise RuntimeError, "failed to compute analytic rank"
    RuntimeError: failed to compute analytic rank
**********************************************************************
File "/home/peter/sage/sage-3.4/devel/sage/sage/schemes/elliptic_curves/ell_rational_field.py", line 1182:
    sage: E.analytic_rank(algorithm='all')
Exception raised:
    Traceback (most recent call last):
      File "/home/peter/sage/sage-3.4/local/bin/ncadoctest.py", line 1231, in run_one_test
        self.run_one_example(test, example, filename, compileflags)
      File "/home/peter/sage/sage-3.4/local/bin/sagedoctest.py", line 38, in run_one_example
        OrigDocTestRunner.run_one_example(self, test, example, filename, compileflags)
      File "/home/peter/sage/sage-3.4/local/bin/ncadoctest.py", line 1172, in run_one_example
        compileflags, 1) in test.globs
      File "<doctest __main__.example_27[6]>", line 1, in <module>
        E.analytic_rank(algorithm='all')###line 1182:
    sage: E.analytic_rank(algorithm='all')
      File "/home/peter/sage/sage-3.4/local/lib/python2.5/site-packages/sage/schemes/elliptic_curves/ell_rational_field.py", line 1214, in analytic_rank
        self.analytic_rank('rubinstein'), self.analytic_rank('sympow')]))
      File "/home/peter/sage/sage-3.4/local/lib/python2.5/site-packages/sage/schemes/elliptic_curves/ell_rational_field.py", line 1208, in analytic_rank
        return sympow.analytic_rank(self)[0]
      File "/home/peter/sage/sage-3.4/local/lib/python2.5/site-packages/sage/lfunctions/sympow.py", line 287, in analytic_rank
        raise RuntimeError, "failed to compute analytic rank"
    RuntimeError: failed to compute analytic rank
**********************************************************************
1 items had failures:
   2 of   9 in __main__.example_27
***Test Failed*** 2 failures.
For whitespace errors, see the file /home/peter/sage/sage-3.4/tmp/.doctest_ell_rational_field.py
         [85.2 s]

sage -t "devel/sage/sage/modules/free_module_element.pyx"

Numeric noise.

**********************************************************************
File "/home/peter/sage/sage-3.4/devel/sage/sage/modules/free_module_element.pyx", line 505:
    sage: vector(RDF, {1:pi, 1000:e})._sage_input_(SageInputBuilder(), False)
Expected:
    {call: {atomic:vector}({atomic:RDF}, {dict: {{atomic:1}:{atomic:3.1415926535897931}, {atomic:1000}:{atomic:2.7182818284590451}} })}
Got:
    {call: {atomic:vector}({atomic:RDF}, {dict: {{atomic:1}:{atomic:3.1415926535897931}, {atomic:1000}:{atomic:2.7182818284590455}} })}
**********************************************************************
1 items had failures:
   1 of  10 in __main__.example_8
***Test Failed*** 1 failures.
For whitespace errors, see the file /home/peter/sage/sage-3.4/tmp/.doctest_free_module_element.py
         [20.1 s]

sage -t "devel/sage/sage/libs/pari/gen.pyx"

System ran out of swap.

*** *** Error: TIMED OUT! PROCESS KILLED! *** ***
*** *** Error: TIMED OUT! *** ***
**********************************************************************
File "/home/peter/sage/sage-3.4/devel/sage/sage/libs/pari/gen.pyx", line 8827:
    sage: print "ignore this";  get_memory_usage()                       # random output
Exception raised:
    Traceback (most recent call last):
      File "/home/peter/sage/sage-3.4/local/bin/ncadoctest.py", line 1231, in run_one_test
        self.run_one_example(test, example, filename, compileflags)
      File "/home/peter/sage/sage-3.4/local/bin/sagedoctest.py", line 38, in run_one_example
        OrigDocTestRunner.run_one_example(self, test, example, filename, compileflags)
      File "/home/peter/sage/sage-3.4/local/bin/ncadoctest.py", line 1172, in run_one_example
        compileflags, 1) in test.globs
      File "<doctest __main__.example_283[2]>", line 1, in <module>
        print "ignore this";  get_memory_usage()                       # random output###line 8827:
    sage: print "ignore this";  get_memory_usage()                       # random output
      File "/home/peter/sage/sage-3.4/local/lib/python2.5/site-packages/sage/misc/getusage.py", line 81, in get_memory_usage
        raise NotImplementedError, "memory usage not implemented on platform %s"%U
    NotImplementedError: memory usage not implemented on platform freebsd
**********************************************************************
File "/home/peter/sage/sage-3.4/devel/sage/sage/libs/pari/gen.pyx", line 8830:
    sage: print "ignore this";  get_memory_usage()                       # random output
Exception raised:
    Traceback (most recent call last):
      File "/home/peter/sage/sage-3.4/local/bin/ncadoctest.py", line 1231, in run_one_test
        self.run_one_example(test, example, filename, compileflags)
      File "/home/peter/sage/sage-3.4/local/bin/sagedoctest.py", line 38, in run_one_example
        OrigDocTestRunner.run_one_example(self, test, example, filename, compileflags)
      File "/home/peter/sage/sage-3.4/local/bin/ncadoctest.py", line 1172, in run_one_example
        compileflags, 1) in test.globs
      File "<doctest __main__.example_283[4]>", line 1, in <module>
        print "ignore this";  get_memory_usage()                       # random output###line 8830:
    sage: print "ignore this";  get_memory_usage()                       # random output
      File "/home/peter/sage/sage-3.4/local/lib/python2.5/site-packages/sage/misc/getusage.py", line 81, in get_memory_usage
        raise NotImplementedError, "memory usage not implemented on platform %s"%U
    NotImplementedError: memory usage not implemented on platform freebsd
**********************************************************************
File "/home/peter/sage/sage-3.4/devel/sage/sage/libs/pari/gen.pyx", line 8833:
    sage: print "ignore this";  get_memory_usage()                       # random output
Exception raised:
    Traceback (most recent call last):
      File "/home/peter/sage/sage-3.4/local/bin/ncadoctest.py", line 1231, in run_one_test
        self.run_one_example(test, example, filename, compileflags)
      File "/home/peter/sage/sage-3.4/local/bin/sagedoctest.py", line 38, in run_one_example
        OrigDocTestRunner.run_one_example(self, test, example, filename, compileflags)
      File "/home/peter/sage/sage-3.4/local/bin/ncadoctest.py", line 1172, in run_one_example
        compileflags, 1) in test.globs
      File "<doctest __main__.example_283[6]>", line 1, in <module>
        print "ignore this";  get_memory_usage()                       # random output###line 8833:
    sage: print "ignore this";  get_memory_usage()                       # random output
      File "/home/peter/sage/saFor whitespace errors, see the file /home/peter/sage/sage-3.4/tmp/.doctest_gen.py*** *** Error: TIMED OUT! *** ***
         [363.3 s]

sage -t "devel/sage/sage/misc/getusage.py"

**********************************************************************
File "/home/peter/sage/sage-3.4/devel/sage/sage/misc/getusage.py", line 25:
    sage: print "ignore this";  top()              # random output
Exception raised:
    Traceback (most recent call last):
      File "/home/peter/sage/sage-3.4/local/bin/ncadoctest.py", line 1231, in run_one_test
        self.run_one_example(test, example, filename, compileflags)
      File "/home/peter/sage/sage-3.4/local/bin/sagedoctest.py", line 38, in run_one_example
        OrigDocTestRunner.run_one_example(self, test, example, filename, compileflags)
      File "/home/peter/sage/sage-3.4/local/bin/ncadoctest.py", line 1172, in run_one_example
        compileflags, 1) in test.globs
      File "<doctest __main__.example_1[2]>", line 1, in <module>
        print "ignore this";  top()              # random output###line 25:
    sage: print "ignore this";  top()              # random output
      File "/home/peter/sage/sage-3.4/local/lib/python2.5/site-packages/sage/misc/getusage.py", line 38, in top
        raise NotImplementedError, "top not implemented on platform %s"%U
    NotImplementedError: top not implemented on platform freebsd
**********************************************************************
File "/home/peter/sage/sage-3.4/devel/sage/sage/misc/getusage.py", line 68:
    sage: t = get_memory_usage()
Exception raised:
    Traceback (most recent call last):
      File "/home/peter/sage/sage-3.4/local/bin/ncadoctest.py", line 1231, in run_one_test
        self.run_one_example(test, example, filename, compileflags)
      File "/home/peter/sage/sage-3.4/local/bin/sagedoctest.py", line 38, in run_one_example
        OrigDocTestRunner.run_one_example(self, test, example, filename, compileflags)
      File "/home/peter/sage/sage-3.4/local/bin/ncadoctest.py", line 1172, in run_one_example
        compileflags, 1) in test.globs
      File "<doctest __main__.example_2[2]>", line 1, in <module>
        t = get_memory_usage()###line 68:
    sage: t = get_memory_usage()
      File "/home/peter/sage/sage-3.4/local/lib/python2.5/site-packages/sage/misc/getusage.py", line 81, in get_memory_usage
        raise NotImplementedError, "memory usage not implemented on platform %s"%U
    NotImplementedError: memory usage not implemented on platform freebsd
**********************************************************************
File "/home/peter/sage/sage-3.4/devel/sage/sage/misc/getusage.py", line 69:
    sage: get_memory_usage(t)          # amount of memory more than when we defined t.
Exception raised:
    Traceback (most recent call last):
      File "/home/peter/sage/sage-3.4/local/bin/ncadoctest.py", line 1231, in run_one_test
        self.run_one_example(test, example, filename, compileflags)
      File "/home/peter/sage/sage-3.4/local/bin/sagedoctest.py", line 38, in run_one_example
        OrigDocTestRunner.run_one_example(self, test, example, filename, compileflags)
      File "/home/peter/sage/sage-3.4/local/bin/ncadoctest.py", line 1172, in run_one_example
        compileflags, 1) in test.globs
      File "<doctest __main__.example_2[3]>", line 1, in <module>
        get_memory_usage(t)          # amount of memory more than when we defined t.###line 69:
    sage: get_memory_usage(t)          # amount of memory more than when we defined t.
    NameError: name 't' is not defined
**********************************************************************
2 items had failures:
   1 of   3 in __main__.example_1
   2 of   4 in __main__.example_2
***Test Failed*** 3 failures.
For whitespace errors, see the file /home/peter/sage/sage-3.4/tmp/.doctest_getusage.py
         [9.2 s]

sage -t "devel/sage/sage/calculus/calculus.py"

Numeric noise.

**********************************************************************
File "/home/peter/sage/sage-3.4/devel/sage/sage/calculus/calculus.py", line 3161:
    sage: numerical_integral(f, 0, 1)
Expected:
    (0.52848223225314706, 6.8392846084921134e-07)
Got:
    (0.52848223225314706, 6.8392846084921049e-07)
**********************************************************************
File "/home/peter/sage/sage-3.4/devel/sage/sage/calculus/calculus.py", line 3792:
    sage: a.find_root(0,0.002)
Expected:
    0.0004110514049349341...
Got:
    0.00041105140493493428
**********************************************************************
2 items had failures:
   1 of  16 in __main__.example_73
   1 of  25 in __main__.example_84
***Test Failed*** 2 failures.
For whitespace errors, see the file /home/peter/sage/sage-3.4/tmp/.doctest_calculus.py
         [108.9 s]

sage -t "devel/sage/sage/combinat/partition.py"

**********************************************************************
File "/home/peter/sage/sage-3.4/devel/sage/sage/combinat/partition.py", line 3390:
    sage: number_of_partitions( n - (n % 385) + 369) % 385 == 0
Expected:
    True
Got:
    False
**********************************************************************
File "/home/peter/sage/sage-3.4/devel/sage/sage/combinat/partition.py", line 3393:
    sage: number_of_partitions( n - (n % 385) + 369) % 385 == 0
Expected:
    True
Got:
    False
**********************************************************************
File "/home/peter/sage/sage-3.4/devel/sage/sage/combinat/partition.py", line 3396:
    sage: number_of_partitions( n - (n % 385) + 369) % 385 == 0
Expected:
    True
Got:
    False
**********************************************************************
File "/home/peter/sage/sage-3.4/devel/sage/sage/combinat/partition.py", line 3399:
    sage: number_of_partitions( n - (n % 385) + 369) % 385 == 0
Expected:
    True
Got:
    False
**********************************************************************
File "/home/peter/sage/sage-3.4/devel/sage/sage/combinat/partition.py", line 3402:
    sage: number_of_partitions( n - (n % 385) + 369) % 385 == 0
Expected:
    True
Got:
    False
**********************************************************************
File "/home/peter/sage/sage-3.4/devel/sage/sage/combinat/partition.py", line 3405:
    sage: number_of_partitions( n - (n % 385) + 369) % 385 == 0
Expected:
    True
Got:
    False
**********************************************************************
File "/home/peter/sage/sage-3.4/devel/sage/sage/combinat/partition.py", line 3408:
    sage: number_of_partitions( n - (n % 385) + 369) % 385 == 0
Expected:
    True
Got:
    False
**********************************************************************
File "/home/peter/sage/sage-3.4/devel/sage/sage/combinat/partition.py", line 3416:
    sage: len([n for n in [1..500] if number_of_partitions(n) != number_of_partitions(n,algorithm='pari')])
Expected:
    0
Got:
    17
**********************************************************************
1 items had failures:
   8 of  40 in __main__.example_125
***Test Failed*** 8 failures.
For whitespace errors, see the file /home/peter/sage/sage-3.4/tmp/.doctest_partition.py
         [27.7 s]

sage -t "devel/sage/sage/lfunctions/sympow.py"

**********************************************************************
File "/home/peter/sage/sage-3.4/devel/sage/sage/lfunctions/sympow.py", line 265:
    sage: sympow.analytic_rank(EllipticCurve('11a'))
Exception raised:
    Traceback (most recent call last):
      File "/home/peter/sage/sage-3.4/local/bin/ncadoctest.py", line 1231, in run_one_test
        self.run_one_example(test, example, filename, compileflags)
      File "/home/peter/sage/sage-3.4/local/bin/sagedoctest.py", line 38, in run_one_example
        OrigDocTestRunner.run_one_example(self, test, example, filename, compileflags)
      File "/home/peter/sage/sage-3.4/local/bin/ncadoctest.py", line 1172, in run_one_example
        compileflags, 1) in test.globs
      File "<doctest __main__.example_7[2]>", line 1, in <module>
        sympow.analytic_rank(EllipticCurve('11a'))###line 265:
    sage: sympow.analytic_rank(EllipticCurve('11a'))
      File "/home/peter/sage/sage-3.4/local/lib/python2.5/site-packages/sage/lfunctions/sympow.py", line 287, in analytic_rank
        raise RuntimeError, "failed to compute analytic rank"
    RuntimeError: failed to compute analytic rank
**********************************************************************
File "/home/peter/sage/sage-3.4/devel/sage/sage/lfunctions/sympow.py", line 269:
    sage: sympow.analytic_rank(EllipticCurve('389a'))
Exception raised:
    Traceback (most recent call last):
      File "/home/peter/sage/sage-3.4/local/bin/ncadoctest.py", line 1231, in run_one_test
        self.run_one_example(test, example, filename, compileflags)
      File "/home/peter/sage/sage-3.4/local/bin/sagedoctest.py", line 38, in run_one_example
        OrigDocTestRunner.run_one_example(self, test, example, filename, compileflags)
      File "/home/peter/sage/sage-3.4/local/bin/ncadoctest.py", line 1172, in run_one_example
        compileflags, 1) in test.globs
      File "<doctest __main__.example_7[4]>", line 1, in <module>
        sympow.analytic_rank(EllipticCurve('389a'))###line 269:
    sage: sympow.analytic_rank(EllipticCurve('389a'))
      File "/home/peter/sage/sage-3.4/local/lib/python2.5/site-packages/sage/lfunctions/sympow.py", line 287, in analytic_rank
        raise RuntimeError, "failed to compute analytic rank"
    RuntimeError: failed to compute analytic rank
**********************************************************************
File "/home/peter/sage/sage-3.4/devel/sage/sage/lfunctions/sympow.py", line 273:
    sage: sympow.analytic_rank(EllipticCurve([1, -1, 0, -79, 289]))
Exception raised:
    Traceback (most recent call last):
      File "/home/peter/sage/sage-3.4/local/bin/ncadoctest.py", line 1231, in run_one_test
        self.run_one_example(test, example, filename, compileflags)
      File "/home/peter/sage/sage-3.4/local/bin/sagedoctest.py", line 38, in run_one_example
        OrigDocTestRunner.run_one_example(self, test, example, filename, compileflags)
      File "/home/peter/sage/sage-3.4/local/bin/ncadoctest.py", line 1172, in run_one_example
        compileflags, 1) in test.globs
      File "<doctest __main__.example_7[6]>", line 1, in <module>
        sympow.analytic_rank(EllipticCurve([Integer(1), -Integer(1), Integer(0), -Integer(79), Integer(289)]))###line 273:
    sage: sympow.analytic_rank(EllipticCurve([1, -1, 0, -79, 289]))
      File "/home/peter/sage/sage-3.4/local/lib/python2.5/site-packages/sage/lfunctions/sympow.py", line 287, in analytic_rank
        raise RuntimeError, "failed to compute analytic rank"
    RuntimeError: failed to compute analytic rank
**********************************************************************
File "/home/peter/sage/sage-3.4/devel/sage/sage/lfunctions/sympow.py", line 277:
    sage: sympow.analytic_rank(EllipticCurve([1, 1, 0, -2582, 48720]))  # long
Exception raised:
    Traceback (most recent call last):
      File "/home/peter/sage/sage-3.4/local/bin/ncadoctest.py", line 1231, in run_one_test
        self.run_one_example(test, example, filename, compileflags)
      File "/home/peter/sage/sage-3.4/local/bin/sagedoctest.py", line 38, in run_one_example
        OrigDocTestRunner.run_one_example(self, test, example, filename, compileflags)
      File "/home/peter/sage/sage-3.4/local/bin/ncadoctest.py", line 1172, in run_one_example
        compileflags, 1) in test.globs
      File "<doctest __main__.example_7[8]>", line 1, in <module>
        sympow.analytic_rank(EllipticCurve([Integer(1), Integer(1), Integer(0), -Integer(2582), Integer(48720)]))  # long###line 277:
    sage: sympow.analytic_rank(EllipticCurve([1, 1, 0, -2582, 48720]))  # long
      File "/home/peter/sage/sage-3.4/local/lib/python2.5/site-packages/sage/lfunctions/sympow.py", line 287, in analytic_rank
        raise RuntimeError, "failed to compute analytic rank"
    RuntimeError: failed to compute analytic rank
**********************************************************************
1 items had failures:
   4 of  10 in __main__.example_7
***Test Failed*** 4 failures.
For whitespace errors, see the file /home/peter/sage/sage-3.4/tmp/.doctest_sympow.py
         [16.7 s]

sage -t "devel/sage/sage/ext/fast_eval.pyx"

Numeric noise.

**********************************************************************
File "/home/peter/sage/sage-3.4/devel/sage/sage/ext/fast_eval.pyx", line 934:
    sage: f(9)
Expected:
    2.0
Got:
    2.0000000000000004
**********************************************************************
1 items had failures:
   1 of   9 in __main__.example_22
***Test Failed*** 1 failures.
For whitespace errors, see the file /home/peter/sage/sage-3.4/tmp/.doctest_fast_eval.py
         [8.5 s]

sage -t "devel/sage/sage/parallel/multiprocessing.py"

A mysterious error (perphaps a memory error?) occurred, which may have crashed doctest.
         [9.4 s]

sage -t "devel/sage/sage/parallel/decorate.py"

A mysterious error (perphaps a memory error?) occurred, which may have crashed doctest.
         [6.1 s]

sage -t "devel/sage/sage/rings/real_double.pyx"

Numeric noise.

**********************************************************************
File "/home/peter/sage/sage-3.4/devel/sage/sage/rings/real_double.pyx", line 727:
    sage: sage_input(RDF(-e), verify=True, preparse=False)
Expected:
    # Verified
    -RDF(2.7182818284590451)
Got:
    # Verified
    -RDF(2.7182818284590455)
**********************************************************************
1 items had failures:
   1 of  12 in __main__.example_40
***Test Failed*** 1 failures.
For whitespace errors, see the file /home/peter/sage/sage-3.4/tmp/.doctest_real_double.py
         [11.2 s]

sage -t "devel/sage/sage/rings/polynomial/polynomial_integer_dense_flint.pyx"

**********************************************************************
File "/home/peter/sage/sage-3.4/devel/sage/sage/rings/polynomial/polynomial_integer_dense_flint.pyx", line 593:
    sage: g, u, v = F.xgcd(G)
Exception raised:
    Traceback (most recent call last):
      File "/home/peter/sage/sage-3.4/local/bin/ncadoctest.py", line 1231, in run_one_test
        self.run_one_example(test, example, filename, compileflags)
      File "/home/peter/sage/sage-3.4/local/bin/sagedoctest.py", line 38, in run_one_example
        OrigDocTestRunner.run_one_example(self, test, example, filename, compileflags)
      File "/home/peter/sage/sage-3.4/local/bin/ncadoctest.py", line 1172, in run_one_example
        compileflags, 1) in test.globs
      File "<doctest __main__.example_20[4]>", line 1, in <module>
        g, u, v = F.xgcd(G)###line 593:
    sage: g, u, v = F.xgcd(G)
    RuntimeError
**********************************************************************
File "/home/peter/sage/sage-3.4/devel/sage/sage/rings/polynomial/polynomial_integer_dense_flint.pyx", line 594:
    sage: g, u, v
Exception raised:
    Traceback (most recent call last):
      File "/home/peter/sage/sage-3.4/local/bin/ncadoctest.py", line 1231, in run_one_test
        self.run_one_example(test, example, filename, compileflags)
      File "/home/peter/sage/sage-3.4/local/bin/sagedoctest.py", line 38, in run_one_example
        OrigDocTestRunner.run_one_example(self, test, example, filename, compileflags)
      File "/home/peter/sage/sage-3.4/local/bin/ncadoctest.py", line 1172, in run_one_example
        compileflags, 1) in test.globs
      File "<doctest __main__.example_20[5]>", line 1, in <module>
        g, u, v###line 594:
    sage: g, u, v
    NameError: name 'g' is not defined
**********************************************************************
File "/home/peter/sage/sage-3.4/devel/sage/sage/rings/polynomial/polynomial_integer_dense_flint.pyx", line 596:
    sage: u*F + v*G
Exception raised:
    Traceback (most recent call last):
      File "/home/peter/sage/sage-3.4/local/bin/ncadoctest.py", line 1231, in run_one_test
        self.run_one_example(test, example, filename, compileflags)
      File "/home/peter/sage/sage-3.4/local/bin/sagedoctest.py", line 38, in run_one_example
        OrigDocTestRunner.run_one_example(self, test, example, filename, compileflags)
      File "/home/peter/sage/sage-3.4/local/bin/ncadoctest.py", line 1172, in run_one_example
        compileflags, 1) in test.globs
      File "<doctest __main__.example_20[6]>", line 1, in <module>
        u*F + v*G###line 596:
    sage: u*F + v*G
    NameError: name 'u' is not defined
**********************************************************************
File "/home/peter/sage/sage-3.4/devel/sage/sage/rings/polynomial/polynomial_integer_dense_flint.pyx", line 604:
    sage: g, u, v = F.xgcd(G)
Exception raised:
    Traceback (most recent call last):
      File "/home/peter/sage/sage-3.4/local/bin/ncadoctest.py", line 1231, in run_one_test
        self.run_one_example(test, example, filename, compileflags)
      File "/home/peter/sage/sage-3.4/local/bin/sagedoctest.py", line 38, in run_one_example
        OrigDocTestRunner.run_one_example(self, test, example, filename, compileflags)
      File "/home/peter/sage/sage-3.4/local/bin/ncadoctest.py", line 1172, in run_one_example
        compileflags, 1) in test.globs
      File "<doctest __main__.example_20[11]>", line 1, in <module>
        g, u, v = F.xgcd(G)###line 604:
    sage: g, u, v = F.xgcd(G)
    RuntimeError
**********************************************************************
File "/home/peter/sage/sage-3.4/devel/sage/sage/rings/polynomial/polynomial_integer_dense_flint.pyx", line 605:
    sage: g, u, v
Exception raised:
    Traceback (most recent call last):
      File "/home/peter/sage/sage-3.4/local/bin/ncadoctest.py", line 1231, in run_one_test
        self.run_one_example(test, example, filename, compileflags)
      File "/home/peter/sage/sage-3.4/local/bin/sagedoctest.py", line 38, in run_one_example
        OrigDocTestRunner.run_one_example(self, test, example, filename, compileflags)
      File "/home/peter/sage/sage-3.4/local/bin/ncadoctest.py", line 1172, in run_one_example
        compileflags, 1) in test.globs
      File "<doctest __main__.example_20[12]>", line 1, in <module>
        g, u, v###line 605:
    sage: g, u, v
    NameError: name 'g' is not defined
**********************************************************************
File "/home/peter/sage/sage-3.4/devel/sage/sage/rings/polynomial/polynomial_integer_dense_flint.pyx", line 607:
    sage: u*F + v*G
Exception raised:
    Traceback (most recent call last):
      File "/home/peter/sage/sage-3.4/local/bin/ncadoctest.py", line 1231, in run_one_test
        self.run_one_example(test, example, filename, compileflags)
      File "/home/peter/sage/sage-3.4/local/bin/sagedoctest.py", line 38, in run_one_example
        OrigDocTestRunner.run_one_example(self, test, example, filename, compileflags)
      File "/home/peter/sage/sage-3.4/local/bin/ncadoctest.py", line 1172, in run_one_example
        compileflags, 1) in test.globs
      File "<doctest __main__.example_20[13]>", line 1, in <module>
        u*F + v*G###line 607:
    sage: u*F + v*G
    NameError: name 'u' is not defined
**********************************************************************
File "/home/peter/sage/sage-3.4/devel/sage/sage/rings/polynomial/polynomial_integer_dense_flint.pyx", line 1167:
    sage: r = f.resultant(g); r
Exception raised:
    Traceback (most recent call last):
      File "/home/peter/sage/sage-3.4/local/bin/ncadoctest.py", line 1231, in run_one_test
        self.run_one_example(test, example, filename, compileflags)
      File "/home/peter/sage/sage-3.4/local/bin/sagedoctest.py", line 38, in run_one_example
        OrigDocTestRunner.run_one_example(self, test, example, filename, compileflags)
      File "/home/peter/sage/sage-3.4/local/bin/ncadoctest.py", line 1172, in run_one_example
        compileflags, 1) in test.globs
      File "<doctest __main__.example_39[4]>", line 1, in <module>
        r = f.resultant(g); r###line 1167:
    sage: r = f.resultant(g); r
    RuntimeError
**********************************************************************
File "/home/peter/sage/sage-3.4/devel/sage/sage/rings/polynomial/polynomial_integer_dense_flint.pyx", line 1169:
    sage: r.parent() is ZZ
Expected:
    True
Got:
    False
**********************************************************************
2 items had failures:
   6 of  14 in __main__.example_20
   2 of   6 in __main__.example_39
***Test Failed*** 8 failures.
Warning: FLINT stack memory allocation cleanup detected mismatched allocation/releases
Abort trap (core dumped)
For whitespace errors, see the file /home/peter/sage/sage-3.4/tmp/.doctest_polynomial_integer_dense_flint.py
         [20.8 s]

sage -t "devel/sage/sage/rings/polynomial/polynomial_quotient_ring_element.py"

**********************************************************************
File "/home/peter/sage/sage-3.4/devel/sage/sage/rings/polynomial/polynomial_quotient_ring_element.py", line 31:
    sage: z^2
Exception raised:
    Traceback (most recent call last):
      File "/home/peter/sage/sage-3.4/local/bin/ncadoctest.py", line 1231, in run_one_test
        self.run_one_example(test, example, filename, compileflags)
      File "/home/peter/sage/sage-3.4/local/bin/sagedoctest.py", line 38, in run_one_example
        OrigDocTestRunner.run_one_example(self, test, example, filename, compileflags)
      File "/home/peter/sage/sage-3.4/local/bin/ncadoctest.py", line 1172, in run_one_example
        compileflags, 1) in test.globs
      File "<doctest __main__.example_0[7]>", line 1, in <module>
        z**Integer(2)###line 31:
    sage: z^2
      File "element.pyx", line 1215, in sage.structure.element.RingElement.__pow__ (sage/structure/element.c:8955)
      File "element.pyx", line 2857, in sage.structure.element.generic_power_c (sage/structure/element.c:18561)
      File "element.pyx", line 1152, in sage.structure.element.RingElement.__mul__ (sage/structure/element.c:8615)
      File "element.pyx", line 1156, in sage.structure.element.RingElement._mul_ (sage/structure/element.c:8670)
      File "/home/peter/sage/sage-3.4/local/lib/python2.5/site-packages/sage/rings/polynomial/polynomial_quotient_ring_element.py", line 199, in _mul_
        return PolynomialQuotientRingElement(R, prod, check=False)
      File "/home/peter/sage/sage-3.4/local/lib/python2.5/site-packages/sage/rings/polynomial/polynomial_quotient_ring_element.py", line 133, in __init__
        S = P((R.leading_coefficient()/B.leading_coefficient())) * X**(R.degree()-B.degree())
      File "element.pyx", line 1236, in sage.structure.element.RingElement.__div__ (sage/structure/element.c:9099)
      File "element.pyx", line 1240, in sage.structure.element.RingElement._div_ (sage/structure/element.c:9158)
      File "/home/peter/sage/sage-3.4/local/lib/python2.5/site-packages/sage/rings/polynomial/polynomial_quotient_ring_element.py", line 244, in _div_
        return self * ~right
      File "/home/peter/sage/sage-3.4/local/lib/python2.5/site-packages/sage/rings/polynomial/polynomial_quotient_ring_element.py", line 284, in __invert__
        g, _, a = self.parent().modulus().xgcd(self._polynomial)
    RuntimeError
**********************************************************************
File "/home/peter/sage/sage-3.4/devel/sage/sage/rings/polynomial/polynomial_quotient_ring_element.py", line 36:
    sage: z^6
Exception raised:
    Traceback (most recent call last):
      File "/home/peter/sage/sage-3.4/local/bin/ncadoctest.py", line 1231, in run_one_test
        self.run_one_example(test, example, filename, compileflags)
      File "/home/peter/sage/sage-3.4/local/bin/sagedoctest.py", line 38, in run_one_example
        OrigDocTestRunner.run_one_example(self, test, example, filename, compileflags)
      File "/home/peter/sage/sage-3.4/local/bin/ncadoctest.py", line 1172, in run_one_example
        compileflags, 1) in test.globs
      File "<doctest __main__.example_0[8]>", line 1, in <module>
        z**Integer(6)###line 36:
    sage: z^6
      File "element.pyx", line 1215, in sage.structure.element.RingElement.__pow__ (sage/structure/element.c:8955)
      File "element.pyx", line 2862, in sage.structure.element.generic_power_c (sage/structure/element.c:18613)
      File "element.pyx", line 1152, in sage.structure.element.RingElement.__mul__ (sage/structure/element.c:8615)
      File "element.pyx", line 1156, in sage.structure.element.RingElement._mul_ (sage/structure/element.c:8670)
      File "/home/peter/sage/sage-3.4/local/lib/python2.5/site-packages/sage/rings/polynomial/polynomial_quotient_ring_element.py", line 199, in _mul_
        return PolynomialQuotientRingElement(R, prod, check=False)
      File "/home/peter/sage/sAssertion failed: (diff == regind * size), function arena_run_reg_dalloc, file /usr/src/lib/libc/stdlib/malloc.c, line 2536.
age-3.4/local/lib/python2.5/site-packages/sage/rings/polynomial/polynomial_quotient_ring_element.py", line 133, in __init__
        S = P((R.leading_coefficient()/B.leading_coefficient())) * X**(R.degree()-B.degree())
      File "element.pyx", line 1236, in sage.structure.element.RingElement.__div__ (sage/structure/element.c:9099)
      File "element.pyx", line 1240, in sage.structure.element.RingElement._div_ (sage/structure/element.c:9158)
      File "/home/peter/sage/sage-3.4/local/lib/python2.5/site-packages/sage/rings/polynomial/polynomial_quotient_ring_element.py", line 244, in _div_
        return self * ~right
      File "/home/peter/sage/sage-3.4/local/lib/python2.5/site-packages/sage/rings/polynomial/polynomial_quotient_ring_element.py", line 284, in __invert__
        g, _, a = self.parent().modulus().xgcd(self._polynomial)
    RuntimeError
**********************************************************************
1 items had failures:
   2 of  20 in __main__.example_0
***Test Failed*** 2 failures.
Warning: FLINT stack memory allocation cleanup detected mismatched allocation/releases
Abort trap (core dumped)
For whitespace errors, see the file /home/peter/sage/sage-3.4/tmp/.doctest_polynomial_quotient_ring_element.py
         [20.4 s]

sage -t "devel/sage/sage/rings/tests.py"

**********************************************************************
File "/home/peter/sage/sage-3.4/devel/sage/sage/rings/tests.py", line 222:
    sage: sage.rings.tests.test_random_elements(trials=10)
Exception raised:
    Traceback (most recent call last):
      File "/home/peter/sage/sage-3.4/local/bin/ncadoctest.py", line 1231, in run_one_test
        self.run_one_example(test, example, filename, compileflags)
      File "/home/peter/sage/sage-3.4/local/bin/sagedoctest.py", line 38, in run_one_example
        OrigDocTestRunner.run_one_example(self, test, example, filename, compileflags)
      File "/home/peter/sage/sage-3.4/local/bin/ncadoctest.py", line 1172, in run_one_example
        compileflags, 1) in test.globs
      File "<doctest __main__.example_11[2]>", line 1, in <module>
        sage.rings.tests.test_random_elements(trials=Integer(10))###line 222:
    sage: sage.rings.tests.test_random_elements(trials=10)
      File "/home/peter/sage/sage-3.4/local/lib/python2.5/site-packages/sage/rings/tests.py", line 230, in test_random_elements
        print "survived %s tests (memory usage = %s)"%(i, get_memory_usage())
      File "/home/peter/sage/sage-3.4/local/lib/python2.5/site-packages/sage/misc/getusage.py", line 81, in get_memory_usage
        raise NotImplementedError, "memory usage not implemented on platform %s"%U
    NotImplementedError: memory usage not implemented on platform freebsd
**********************************************************************
File "/home/peter/sage/sage-3.4/devel/sage/sage/rings/tests.py", line 249:
    sage: sage.rings.tests.test_random_arith(trials=10)
Exception raised:
    Traceback (most recent call last):
      File "/home/peter/sage/sage-3.4/local/bin/ncadoctest.py", line 1231, in run_one_test
        self.run_one_example(test, example, filename, compileflags)
      File "/home/peter/sage/sage-3.4/local/bin/sagedoctest.py", line 38, in run_one_example
        OrigDocTestRunner.run_one_example(self, test, example, filename, compileflags)
      File "/home/peter/sage/sage-3.4/local/bin/ncadoctest.py", line 1172, in run_one_example
        compileflags, 1) in test.globs
      File "<doctest __main__.example_12[2]>", line 1, in <module>
        sage.rings.tests.test_random_arith(trials=Integer(10))###line 249:
    sage: sage.rings.tests.test_random_arith(trials=10)
      File "/home/peter/sage/sage-3.4/local/lib/python2.5/site-packages/sage/rings/tests.py", line 256, in test_random_arith
        print "survived %s tests (memory usage = %s)"%(i, get_memory_usage())
      File "/home/peter/sage/sage-3.4/local/lib/python2.5/site-packages/sage/misc/getusage.py", line 81, in get_memory_usage
        raise NotImplementedError, "memory usage not implemented on platform %s"%U
    NotImplementedError: memory usage not implemented on platform freebsd
**********************************************************************
2 items had failures:
   1 of   3 in __main__.example_11
   1 of   3 in __main__.example_12
***Test Failed*** 2 failures.
For whitespace errors, see the file /home/peter/sage/sage-3.4/tmp/.doctest_tests.py
         [8.9 s]

sage -t "devel/sage/sage/rings/integer.pyx"

Numeric noise.

**********************************************************************
File "/home/peter/sage/sage-3.4/devel/sage/sage/rings/integer.pyx", line 1388:
    sage: 2^float(1.5)       # python float
Expected:
    2.8284271247461903
Got:
    2.8284271247461898
**********************************************************************
1 items had failures:
   1 of  26 in __main__.example_34
***Test Failed*** 1 failures.
For whitespace errors, see the file /home/peter/sage/sage-3.4/tmp/.doctest_integer.py
         [16.7 s]

freebsd/sage-3.4/8.xErrs (last edited 2009-04-03 01:16:54 by PeterJeremy)