Detailed error log from "make test" on FreeBSD 7.x/amd64

Contents

sage -t "devel/sage/doc/en/bordeaux_2008/modular_forms_and_hecke_operators.rst"

**********************************************************************
File "/home/pjeremy/sage-3.4/devel/sage/doc/en/bordeaux_2008/modular_forms_and_hecke_operators.rst", line 163:
    sage: sloane_find(a)
Exception raised:
    Traceback (most recent call last):
      File "/home/pjeremy/sage-3.4/local/bin/ncadoctest.py", line 1231, in run_one_test
        self.run_one_example(test, example, filename, compileflags)
      File "/home/pjeremy/sage-3.4/local/bin/sagedoctest.py", line 38, in run_one_example
        OrigDocTestRunner.run_one_example(self, test, example, filename, compileflags)
      File "/home/pjeremy/sage-3.4/local/bin/ncadoctest.py", line 1172, in run_one_example
        compileflags, 1) in test.globs
      File "<doctest __main__.example_3[4]>", line 1, in <module>
        sloane_find(a)###line 163:
    sage: sloane_find(a)
      File "/home/pjeremy/sage-3.4/local/lib/python2.5/site-packages/sage/databases/sloane.py", line 363, in sloane_find
        raise IOError, "%s\nError fetching the following website:\n    %s\nTry checking your internet connection."%(msg, url)
    IOError: [Errno url error] invalid proxy for http: 'proxy.alcatel.com.au:3128'
    Error fetching the following website:
        http://www.research.att.com/~njas/sequences/
    Try checking your internet connection.
**********************************************************************
1 items had failures:
   1 of   5 in __main__.example_3
***Test Failed*** 1 failures.
For whitespace errors, see the file /home/pjeremy/sage-3.4/tmp/.doctest_modular_forms_and_hecke_operators.py
         [4.6 s]

sage -t "devel/sage/sage/misc/getusage.py"

**********************************************************************
File "/home/pjeremy/sage-3.4/devel/sage/sage/misc/getusage.py", line 25:
    sage: print "ignore this";  top()              # random output
Exception raised:
    Traceback (most recent call last):
      File "/home/pjeremy/sage-3.4/local/bin/ncadoctest.py", line 1231, in run_one_test
        self.run_one_example(test, example, filename, compileflags)
      File "/home/pjeremy/sage-3.4/local/bin/sagedoctest.py", line 38, in run_one_example
        OrigDocTestRunner.run_one_example(self, test, example, filename, compileflags)
      File "/home/pjeremy/sage-3.4/local/bin/ncadoctest.py", line 1172, in run_one_example
        compileflags, 1) in test.globs
      File "<doctest __main__.example_1[2]>", line 1, in <module>
        print "ignore this";  top()              # random output###line 25:
    sage: print "ignore this";  top()              # random output
      File "/home/pjeremy/sage-3.4/local/lib/python2.5/site-packages/sage/misc/getusage.py", line 38, in top
        raise NotImplementedError, "top not implemented on platform %s"%U
    NotImplementedError: top not implemented on platform freebsd
**********************************************************************
File "/home/pjeremy/sage-3.4/devel/sage/sage/misc/getusage.py", line 68:
    sage: t = get_memory_usage()
Exception raised:
    Traceback (most recent call last):
      File "/home/pjeremy/sage-3.4/local/bin/ncadoctest.py", line 1231, in run_one_test
        self.run_one_example(test, example, filename, compileflags)
      File "/home/pjeremy/sage-3.4/local/bin/sagedoctest.py", line 38, in run_one_example
        OrigDocTestRunner.run_one_example(self, test, example, filename, compileflags)
      File "/home/pjeremy/sage-3.4/local/bin/ncadoctest.py", line 1172, in run_one_example
        compileflags, 1) in test.globs
      File "<doctest __main__.example_2[2]>", line 1, in <module>
        t = get_memory_usage()###line 68:
    sage: t = get_memory_usage()
      File "/home/pjeremy/sage-3.4/local/lib/python2.5/site-packages/sage/misc/getusage.py", line 81, in get_memory_usage
        raise NotImplementedError, "memory usage not implemented on platform %s"%U
    NotImplementedError: memory usage not implemented on platform freebsd
**********************************************************************
File "/home/pjeremy/sage-3.4/devel/sage/sage/misc/getusage.py", line 69:
    sage: get_memory_usage(t)          # amount of memory more than when we defined t.
Exception raised:
    Traceback (most recent call last):
      File "/home/pjeremy/sage-3.4/local/bin/ncadoctest.py", line 1231, in run_one_test
        self.run_one_example(test, example, filename, compileflags)
      File "/home/pjeremy/sage-3.4/local/bin/sagedoctest.py", line 38, in run_one_example
        OrigDocTestRunner.run_one_example(self, test, example, filename, compileflags)
      File "/home/pjeremy/sage-3.4/local/bin/ncadoctest.py", line 1172, in run_one_example
        compileflags, 1) in test.globs
      File "<doctest __main__.example_2[3]>", line 1, in <module>
        get_memory_usage(t)          # amount of memory more than when we defined t.###line 69:
    sage: get_memory_usage(t)          # amount of memory more than when we defined t.
    NameError: name 't' is not defined
**********************************************************************
2 items had failures:
   1 of   3 in __main__.example_1
   2 of   4 in __main__.example_2
***Test Failed*** 3 failures.
For whitespace errors, see the file /home/pjeremy/sage-3.4/tmp/.doctest_getusage.py
         [2.4 s]

sage -t "devel/sage/sage/modules/free_module_element.pyx"

**********************************************************************
File "/home/pjeremy/sage-3.4/devel/sage/sage/modules/free_module_element.pyx", line 1034:
    sage: plot(v, plot_type='point')+frame3d((0,0,0), v.list())
Exception raised:
    Traceback (most recent call last):
      File "/home/pjeremy/sage-3.4/local/bin/ncadoctest.py", line 1231, in run_one_test
        self.run_one_example(test, example, filename, compileflags)
      File "/home/pjeremy/sage-3.4/local/bin/sagedoctest.py", line 38, in run_one_example
        OrigDocTestRunner.run_one_example(self, test, example, filename, compileflags)
      File "/home/pjeremy/sage-3.4/local/bin/ncadoctest.py", line 1172, in run_one_example
        compileflags, 1) in test.globs
      File "<doctest __main__.example_26[12]>", line 1, in <module>
        plot(v, plot_type='point')+frame3d((Integer(0),Integer(0),Integer(0)), v.list())###line 1034:
    sage: plot(v, plot_type='point')+frame3d((0,0,0), v.list())
      File "base.pyx", line 62, in sage.plot.plot3d.base.Graphics3d.__repr__ (sage/plot/plot3d/base.c:1973)
      File "base.pyx", line 537, in sage.plot.plot3d.base.Graphics3d.show (sage/plot/plot3d/base.c:8561)
      File "base.pyx", line 205, in sage.plot.plot3d.base.Graphics3d.tachyon (sage/plot/plot3d/base.c:3815)
      File "base.pyx", line 211, in sage.plot.plot3d.base.Graphics3d.tachyon_str (sage/plot/plot3d/base.c:3878)
      File "base.pyx", line 619, in sage.plot.plot3d.base.Graphics3dGroup.tachyon_repr (sage/plot/plot3d/base.c:9930)
      File "base.pyx", line 694, in sage.plot.plot3d.base.TransformGroup.tachyon_repr (sage/plot/plot3d/base.c:11703)
      File "base.pyx", line 694, in sage.plot.plot3d.base.TransformGroup.tachyon_repr (sage/plot/plot3d/base.c:11703)
      File "base.pyx", line 694, in sage.plot.plot3d.base.TransformGroup.tachyon_repr (sage/plot/plot3d/base.c:11703)
      File "shapes.pyx", line 408, in sage.plot.plot3d.shapes.Sphere.tachyon_repr (sage/plot/plot3d/shapes.c:5389)
      File "parametric_surface.pyx", line 132, in sage.plot.plot3d.parametric_surface.ParametricSurface.tachyon_repr (sage/plot/plot3d/parametric_surface.c:1826)
    RuntimeError
**********************************************************************
File "/home/pjeremy/sage-3.4/devel/sage/sage/modules/free_module_element.pyx", line 505:
    sage: vector(RDF, {1:pi, 1000:e})._sage_input_(SageInputBuilder(), False)
Expected:
    {call: {atomic:vector}({atomic:RDF}, {dict: {{atomic:1}:{atomic:3.1415926535897931}, {atomic:1000}:{atomic:2.7182818284590451}} })}
Got:
    {call: {atomic:vector}({atomic:RDF}, {dict: {{atomic:1}:{atomic:3.1415926535897931}, {atomic:1000}:{atomic:2.7182818284590455}} })}
**********************************************************************
2 items had failures:
   1 of  17 in __main__.example_26
   1 of  10 in __main__.example_8
***Test Failed*** 2 failures.
For whitespace errors, see the file /home/pjeremy/sage-3.4/tmp/.doctest_free_module_element.py
         [8.2 s]

sage -t "devel/sage/sage/libs/pari/gen.pyx"

**********************************************************************
File "/home/pjeremy/sage-3.4/devel/sage/sage/libs/pari/gen.pyx", line 8827:
    sage: print "ignore this";  get_memory_usage()                       # random output
Exception raised:
    Traceback (most recent call last):
      File "/home/pjeremy/sage-3.4/local/bin/ncadoctest.py", line 1231, in run_one_test
        self.run_one_example(test, example, filename, compileflags)
      File "/home/pjeremy/sage-3.4/local/bin/sagedoctest.py", line 38, in run_one_example
        OrigDocTestRunner.run_one_example(self, test, example, filename, compileflags)
      File "/home/pjeremy/sage-3.4/local/bin/ncadoctest.py", line 1172, in run_one_example
        compileflags, 1) in test.globs
      File "<doctest __main__.example_283[2]>", line 1, in <module>
        print "ignore this";  get_memory_usage()                       # random output###line 8827:
    sage: print "ignore this";  get_memory_usage()                       # random output
      File "/home/pjeremy/sage-3.4/local/lib/python2.5/site-packages/sage/misc/getusage.py", line 81, in get_memory_usage
        raise NotImplementedError, "memory usage not implemented on platform %s"%U
    NotImplementedError: memory usage not implemented on platform freebsd
**********************************************************************
File "/home/pjeremy/sage-3.4/devel/sage/sage/libs/pari/gen.pyx", line 8830:
    sage: print "ignore this";  get_memory_usage()                       # random output
Exception raised:
    Traceback (most recent call last):
      File "/home/pjeremy/sage-3.4/local/bin/ncadoctest.py", line 1231, in run_one_test
        self.run_one_example(test, example, filename, compileflags)
      File "/home/pjeremy/sage-3.4/local/bin/sagedoctest.py", line 38, in run_one_example
        OrigDocTestRunner.run_one_example(self, test, example, filename, compileflags)
      File "/home/pjeremy/sage-3.4/local/bin/ncadoctest.py", line 1172, in run_one_example
        compileflags, 1) in test.globs
      File "<doctest __main__.example_283[4]>", line 1, in <module>
        print "ignore this";  get_memory_usage()                       # random output###line 8830:
    sage: print "ignore this";  get_memory_usage()                       # random output
      File "/home/pjeremy/sage-3.4/local/lib/python2.5/site-packages/sage/misc/getusage.py", line 81, in get_memory_usage
        raise NotImplementedError, "memory usage not implemented on platform %s"%U
    NotImplementedError: memory usage not implemented on platform freebsd
**********************************************************************
File "/home/pjeremy/sage-3.4/devel/sage/sage/libs/pari/gen.pyx", line 8833:
    sage: print "ignore this";  get_memory_usage()                       # random output
Exception raised:
    Traceback (most recent call last):
      File "/home/pjeremy/sage-3.4/local/bin/ncadoctest.py", line 1231, in run_one_test
        self.run_one_example(test, example, filename, compileflags)
      File "/home/pjeremy/sage-3.4/local/bin/sagedoctest.py", line 38, in run_one_example
        OrigDocTestRunner.run_one_example(self, test, example, filename, compileflags)
      File "/home/pjeremy/sage-3.4/local/bin/ncadoctest.py", line 1172, in run_one_example
        compileflags, 1) in test.globs
      File "<doctest __main__.example_283[6]>", line 1, in <module>
        print "ignore this";  get_memory_usage()                       # random output###line 8833:
    sage: print "ignore this";  get_memory_usage()                       # random output
      File "/home/pjeremy/sage-3.4/local/lib/python2.5/site-packages/sage/misc/getusage.py", line 81, in get_memory_usage
        raise NotImplementedError, "memory usage not implemented on platform %s"%U
    NotImplementedError: memory usage not implemented on platform freebsd
**********************************************************************
File "/home/pjeremy/sage-3.4/devel/sage/sage/libs/pari/gen.pyx", line 8841:
    sage: print "ignore this";  get_memory_usage()                       # random output
Exception raised:
    Traceback (most recent call last):
      File "/home/pjeremy/sage-3.4/local/bin/ncadoctest.py", line 1231, in run_one_test
        self.run_one_example(test, example, filename, compileflags)
      File "/home/pjeremy/sage-3.4/local/bin/sagedoctest.py", line 38, in run_one_example
        OrigDocTestRunner.run_one_example(self, test, example, filename, compileflags)
      File "/home/pjeremy/sage-3.4/local/bin/ncadoctest.py", line 1172, in run_one_example
        compileflags, 1) in test.globs
      File "<doctest __main__.example_283[8]>", line 1, in <module>
        print "ignore this";  get_memory_usage()                       # random output###line 8841:
    sage: print "ignore this";  get_memory_usage()                       # random output
      File "/home/pjeremy/sage-3.4/local/lib/python2.5/site-packages/sage/misc/getusage.py", line 81, in get_memory_usage
        raise NotImplementedError, "memory usage not implemented on platform %s"%U
    NotImplementedError: memory usage not implemented on platform freebsd
**********************************************************************
1 items had failures:
   4 of   9 in __main__.example_283
***Test Failed*** 4 failures.
For whitespace errors, see the file /home/pjeremy/sage-3.4/tmp/.doctest_gen.py
         [4.9 s]

sage -t "devel/sage/sage/parallel/multiprocessing.py"

A mysterious error (perphaps a memory error?) occurred, which may have crashed doctest.
         [6.2 s]

sage -t "devel/sage/sage/parallel/decorate.py"

A mysterious error (perphaps a memory error?) occurred, which may have crashed doctest.
         [6.2 s]

sage -t "devel/sage/sage/rings/polynomial/polynomial_quotient_ring_element.py"

**********************************************************************
File "/home/pjeremy/sage-3.4/devel/sage/sage/rings/polynomial/polynomial_quotient_ring_element.py", line 31:
    sage: z^2
Exception raised:
    Traceback (most recent call last):
      File "/home/pjeremy/sage-3.4/local/bin/ncadoctest.py", line 1231, in run_one_test
        self.run_one_example(test, example, filename, compileflags)
      File "/home/pjeremy/sage-3.4/local/bin/sagedoctest.py", line 38, in run_one_example
        OrigDocTestRunner.run_one_example(self, test, example, filename, compileflags)
      File "/home/pjeremy/sage-3.4/local/bin/ncadoctest.py", line 1172, in run_one_example
        compileflags, 1) in test.globs
      File "<doctest __main__.example_0[7]>", line 1, in <module>
        z**Integer(2)###line 31:
    sage: z^2
      File "element.pyx", line 1215, in sage.structure.element.RingElement.__pow__ (sage/structure/element.c:8955)
      File "element.pyx", line 2857, in sage.structure.element.generic_power_c (sage/structure/element.c:18561)
      File "element.pyx", line 1152, in sage.structure.element.RingElement.__mul__ (sage/structure/element.c:8615)
      File "element.pyx", line 1156, in sage.structure.element.RingElement._mul_ (sage/structure/element.c:8670)
      File "/home/pjeremy/sage-3.4/local/lib/python2.5/site-packages/sage/rings/polynomial/polynomial_quotient_ring_element.py", line 199, in _mul_
        return PolynomialQuotientRingElement(R, prod, check=False)
      File "/home/pjeremy/sage-3.4/local/lib/python2.5/site-packages/sage/rings/polynomial/polynomial_quotient_ring_element.py", line 133, in __init__
        S = P((R.leading_coefficient()/B.leading_coefficient())) * X**(R.degree()-B.degree())
      File "element.pyx", line 1236, in sage.structure.element.RingElement.__div__ (sage/structure/element.c:9099)
      File "element.pyx", line 1240, in sage.structure.element.RingElement._div_ (sage/structure/element.c:9158)
      File "/home/pjeremy/sage-3.4/local/lib/python2.5/site-packages/sage/rings/polynomial/polynomial_quotient_ring_element.py", line 244, in _div_
        return self * ~right
      File "/home/pjeremy/sage-3.4/local/lib/python2.5/site-packages/sage/rings/polynomial/polynomial_quotient_ring_element.py", line 284, in __invert__
        g, _, a = self.parent().modulus().xgcd(self._polynomial)
    RuntimeError
**********************************************************************
File "/home/pjeremy/sage-3.4/devel/sage/sage/rings/polynomial/polynomial_quotient_ring_element.py", line 36:
    sage: z^6
Exception raised:
    Traceback (most recent call last):
      File "/home/pjeremy/sage-3.4/local/bin/ncadoctest.py", line 1231, in run_one_test
        self.run_one_example(test, example, filename, compileflags)
      File "/home/pjeremy/sage-3.4/local/bin/sagedoctest.py", line 38, in run_one_example
        OrigDocTestRunner.run_one_example(self, test, example, filename, compileflags)
      File "/home/pjeremy/sage-3.4/local/bin/ncadoctest.py", line 1172, in run_one_example
        compileflags, 1) in test.globs
      File "<doctest __main__.example_0[8]>", line 1, in <module>
        z**Integer(6)###line 36:
    sage: z^6
      File "element.pyx", line 1215, in sage.structure.element.RingElement.__pow__ (sage/structure/element.c:8955)
      File "element.pyx", line 2862, in sage.structure.element.generic_power_c (sage/structure/element.c:18613)
      File "element.pyx", line 1152, in sage.structure.element.RingElement.__mul__ (sage/structure/element.c:8615)
      File "element.pyx", line 1156, in sage.structure.element.RingElement._mul_ (sage/structure/element.c:8670)
      File "/home/pjeremy/sage-3.4/local/lib/python2.5/site-packages/sage/rings/polynomial/polynomial_quotient_ring_element.py", line 199, in _mul_
        return PolynomialQuotientRingElement(R, prod, check=False)
      File "/home/pjeremy/sage-3.4/local/lib/python2.5/site-packages/sage/rings/polynomial/polynomial_quotient_ring_element.py", line 133, in __init__
        S = P((R.leading_coefficient()/B.leading_coefficient())) * X**(R.degree()-B.degree())
      File "element.pyx", line 1236, in sage.structure.element.RingElement.__div__ (sage/structure/element.c:9099)
      File "element.pyx", line 1240, in sage.structure.element.RingElement._div_ (sage/structure/element.c:9158)
      File "/home/pjeremy/sage-3.4/local/lib/python2.5/site-packages/sage/rings/polynomial/polynomial_quotient_ring_element.py", line 244, in _div_
        return self * ~right
      File "/home/pjeremy/sage-3.4/local/lib/python2.5/site-packages/sage/rings/polynomial/polynomial_quotient_ring_element.py", line 284, in __invert__
        g, _, a = self.parent().modulus().xgcd(self._polynomial)
    RuntimeError
**********************************************************************
1 items had failures:
   2 of  20 in __main__.example_0
***Test Failed*** 2 failures.
Warning: FLINT stack memory allocation cleanup detected mismatched allocation/releases
Warning: FLINT stack memory allocation cleanup detected mismatched allocation/releases
For whitespace errors, see the file /home/pjeremy/sage-3.4/tmp/.doctest_polynomial_quotient_ring_element.py
         [3.0 s]

sage -t "devel/sage/sage/rings/polynomial/pbori.pyx"

**********************************************************************
File "/home/pjeremy/sage-3.4/devel/sage/sage/rings/polynomial/pbori.pyx", line 3920:
    sage: I = sage.rings.ideal.Cyclic(P)
Exception raised:
    Traceback (most recent call last):
      File "/home/pjeremy/sage-3.4/local/bin/ncadoctest.py", line 1231, in run_one_test
        self.run_one_example(test, example, filename, compileflags)
      File "/home/pjeremy/sage-3.4/local/bin/sagedoctest.py", line 38, in run_one_example
        OrigDocTestRunner.run_one_example(self, test, example, filename, compileflags)
      File "/home/pjeremy/sage-3.4/local/bin/ncadoctest.py", line 1172, in run_one_example
        compileflags, 1) in test.globs
      File "<doctest __main__.example_125[4]>", line 1, in <module>
        I = sage.rings.ideal.Cyclic(P)###line 3920:
    sage: I = sage.rings.ideal.Cyclic(P)
      File "/home/pjeremy/sage-3.4/local/lib/python2.5/site-packages/sage/rings/ideal.py", line 927, in Cyclic
        singular.lib("poly")
      File "/home/pjeremy/sage-3.4/local/lib/python2.5/site-packages/sage/interfaces/singular.py", line 697, in lib
        self.eval('LIB "%s"'%lib)
      File "/home/pjeremy/sage-3.4/local/lib/python2.5/site-packages/sage/interfaces/singular.py", line 526, in eval
        self._eval_line('if(defined(%s)>0){kill %s;};'%(var,var), wait_for_prompt=True)
      File "/home/pjeremy/sage-3.4/local/lib/python2.5/site-packages/sage/interfaces/expect.py", line 667, in _eval_line
        raise RuntimeError, "%s\n%s crashed executing %s"%(msg,self, line)
    RuntimeError: End Of File (EOF) in read_nonblocking(). Empty string style platform.
    <pexpect.spawn instance at 0x81d3657a0>
    version: 2.0 ($Revision: 1.151 $)
    command: /home/pjeremy/sage-3.4/local/bin/Singular
    args: ['/home/pjeremy/sage-3.4/local/bin/Singular', '-t', '--ticks-per-sec', '1000']
    patterns:
        > 
    buffer (last 100 chars): 
    before (last 100 chars): ALID$` in line:'1+875422467;'
    abort command(a), continue(c) or quit Singular(q) ?Auf Wiedersehen.

    after: <class 'pexpect.EOF'>
    match: None
    match_index: None
    exitstatus: None
    flag_eof: 1
    pid: 34302
    child_fd: 3
    timeout: None
    delimiter: <class 'pexpect.EOF'>
    logfile: None
    maxread: 1000
    searchwindowsize: None
    delaybeforesend: 0
    Singular crashed executing if(defined(sage52)>0){kill sage52;};
**********************************************************************
File "/home/pjeremy/sage-3.4/devel/sage/sage/rings/polynomial/pbori.pyx", line 3921:
    sage: I = B.ideal([B(f) for f in I.gens()])
Exception raised:
    Traceback (most recent call last):
      File "/home/pjeremy/sage-3.4/local/bin/ncadoctest.py", line 1231, in run_one_test
        self.run_one_example(test, example, filename, compileflags)
      File "/home/pjeremy/sage-3.4/local/bin/sagedoctest.py", line 38, in run_one_example
        OrigDocTestRunner.run_one_example(self, test, example, filename, compileflags)
      File "/home/pjeremy/sage-3.4/local/bin/ncadoctest.py", line 1172, in run_one_example
        compileflags, 1) in test.globs
      File "<doctest __main__.example_125[5]>", line 1, in <module>
        I = B.ideal([B(f) for f in I.gens()])###line 3921:
    sage: I = B.ideal([B(f) for f in I.gens()])
    AttributeError: 'I_class' object has no attribute 'gens'
**********************************************************************
File "/home/pjeremy/sage-3.4/devel/sage/sage/rings/polynomial/pbori.pyx", line 3922:
    sage: gb = I.groebner_basis()
Exception raised:
    Traceback (most recent call last):
      File "/home/pjeremy/sage-3.4/local/bin/ncadoctest.py", line 1231, in run_one_test
        self.run_one_example(test, example, filename, compileflags)
      File "/home/pjeremy/sage-3.4/local/bin/sagedoctest.py", line 38, in run_one_example
        OrigDocTestRunner.run_one_example(self, test, example, filename, compileflags)
      File "/home/pjeremy/sage-3.4/local/bin/ncadoctest.py", line 1172, in run_one_example
        compileflags, 1) in test.globs
      File "<doctest __main__.example_125[6]>", line 1, in <module>
        gb = I.groebner_basis()###line 3922:
    sage: gb = I.groebner_basis()
    AttributeError: 'I_class' object has no attribute 'groebner_basis'
**********************************************************************
File "/home/pjeremy/sage-3.4/devel/sage/sage/rings/polynomial/pbori.pyx", line 3923:
    sage: I.reduce(gb[0])
Exception raised:
    Traceback (most recent call last):
      File "/home/pjeremy/sage-3.4/local/bin/ncadoctest.py", line 1231, in run_one_test
        self.run_one_example(test, example, filename, compileflags)
      File "/home/pjeremy/sage-3.4/local/bin/sagedoctest.py", line 38, in run_one_example
        OrigDocTestRunner.run_one_example(self, test, example, filename, compileflags)
      File "/home/pjeremy/sage-3.4/local/bin/ncadoctest.py", line 1172, in run_one_example
        compileflags, 1) in test.globs
      File "<doctest __main__.example_125[7]>", line 1, in <module>
        I.reduce(gb[Integer(0)])###line 3923:
    sage: I.reduce(gb[0])
    AttributeError: 'I_class' object has no attribute 'reduce'
**********************************************************************
File "/home/pjeremy/sage-3.4/devel/sage/sage/rings/polynomial/pbori.pyx", line 3925:
    sage: I.reduce(gb[0] + 1)
Exception raised:
    Traceback (most recent call last):
      File "/home/pjeremy/sage-3.4/local/bin/ncadoctest.py", line 1231, in run_one_test
        self.run_one_example(test, example, filename, compileflags)
      File "/home/pjeremy/sage-3.4/local/bin/sagedoctest.py", line 38, in run_one_example
        OrigDocTestRunner.run_one_example(self, test, example, filename, compileflags)
      File "/home/pjeremy/sage-3.4/local/bin/ncadoctest.py", line 1172, in run_one_example
        compileflags, 1) in test.globs
      File "<doctest __main__.example_125[8]>", line 1, in <module>
        I.reduce(gb[Integer(0)] + Integer(1))###line 3925:
    sage: I.reduce(gb[0] + 1)
    AttributeError: 'I_class' object has no attribute 'reduce'
**********************************************************************
File "/home/pjeremy/sage-3.4/devel/sage/sage/rings/polynomial/pbori.pyx", line 3927:
    sage: I.reduce(gb[0]*gb[1])
Exception raised:
    Traceback (most recent call last):
      File "/home/pjeremy/sage-3.4/local/bin/ncadoctest.py", line 1231, in run_one_test
        self.run_one_example(test, example, filename, compileflags)
      File "/home/pjeremy/sage-3.4/local/bin/sagedoctest.py", line 38, in run_one_example
        OrigDocTestRunner.run_one_example(self, test, example, filename, compileflags)
      File "/home/pjeremy/sage-3.4/local/bin/ncadoctest.py", line 1172, in run_one_example
        compileflags, 1) in test.globs
      File "<doctest __main__.example_125[9]>", line 1, in <module>
        I.reduce(gb[Integer(0)]*gb[Integer(1)])###line 3927:
    sage: I.reduce(gb[0]*gb[1])
    AttributeError: 'I_class' object has no attribute 'reduce'
**********************************************************************
File "/home/pjeremy/sage-3.4/devel/sage/sage/rings/polynomial/pbori.pyx", line 3929:
    sage: I.reduce(gb[0]*B.gen(1))
Exception raised:
    Traceback (most recent call last):
      File "/home/pjeremy/sage-3.4/local/bin/ncadoctest.py", line 1231, in run_one_test
        self.run_one_example(test, example, filename, compileflags)
      File "/home/pjeremy/sage-3.4/localKilled
For whitespace errors, see the file /home/pjeremy/sage-3.4/tmp/.doctest_pbori.py
         [252.5 s]

sage -t "devel/sage/sage/rings/polynomial/polynomial_ring_constructor.py"

A mysterious error (perphaps a memory error?) occurred, which may have crashed doctest.
         [105.7 s]

sage -t "devel/sage/sage/rings/polynomial/polynomial_singular_interface.py"

**********************************************************************
File "/home/pjeremy/sage-3.4/devel/sage/sage/rings/polynomial/polynomial_singular_interface.py", line 94:
    sage: R.<x> = PolynomialRing(NumberField(w^2+1,'s'))
Expected nothing
Got:
    Maxima crashed -- automatically restarting.
**********************************************************************
1 items had failures:
   1 of  19 in __main__.example_2
***Test Failed*** 1 failures.
For whitespace errors, see the file /home/pjeremy/sage-3.4/tmp/.doctest_polynomial_singular_interface.py
         [91.8 s]

sage -t "devel/sage/sage/rings/polynomial/polynomial_integer_dense_flint.pyx"

**********************************************************************
File "/home/pjeremy/sage-3.4/devel/sage/sage/rings/polynomial/polynomial_integer_dense_flint.pyx", line 593:
    sage: g, u, v = F.xgcd(G)
Exception raised:
    Traceback (most recent call last):
      File "/home/pjeremy/sage-3.4/local/bin/ncadoctest.py", line 1231, in run_one_test
        self.run_one_example(test, example, filename, compileflags)
      File "/home/pjeremy/sage-3.4/local/bin/sagedoctest.py", line 38, in run_one_example
        OrigDocTestRunner.run_one_example(self, test, example, filename, compileflags)
      File "/home/pjeremy/sage-3.4/local/bin/ncadoctest.py", line 1172, in run_one_example
        compileflags, 1) in test.globs
      File "<doctest __main__.example_20[4]>", line 1, in <module>
        g, u, v = F.xgcd(G)###line 593:
    sage: g, u, v = F.xgcd(G)
    RuntimeError
**********************************************************************
File "/home/pjeremy/sage-3.4/devel/sage/sage/rings/polynomial/polynomial_integer_dense_flint.pyx", line 594:
    sage: g, u, v
Exception raised:
    Traceback (most recent call last):
      File "/home/pjeremy/sage-3.4/local/bin/ncadoctest.py", line 1231, in run_one_test
        self.run_one_example(test, example, filename, compileflags)
      File "/home/pjeremy/sage-3.4/local/bin/sagedoctest.py", line 38, in run_one_example
        OrigDocTestRunner.run_one_example(self, test, example, filename, compileflags)
      File "/home/pjeremy/sage-3.4/local/bin/ncadoctest.py", line 1172, in run_one_example
        compileflags, 1) in test.globs
      File "<doctest __main__.example_20[5]>", line 1, in <module>
        g, u, v###line 594:
    sage: g, u, v
    NameError: name 'g' is not defined
**********************************************************************
File "/home/pjeremy/sage-3.4/devel/sage/sage/rings/polynomial/polynomial_integer_dense_flint.pyx", line 596:
    sage: u*F + v*G
Exception raised:
    Traceback (most recent call last):
      File "/home/pjeremy/sage-3.4/local/bin/ncadoctest.py", line 1231, in run_one_test
        self.run_one_example(test, example, filename, compileflags)
      File "/home/pjeremy/sage-3.4/local/bin/sagedoctest.py", line 38, in run_one_example
        OrigDocTestRunner.run_one_example(self, test, example, filename, compileflags)
      File "/home/pjeremy/sage-3.4/local/bin/ncadoctest.py", line 1172, in run_one_example
        compileflags, 1) in test.globs
      File "<doctest __main__.example_20[6]>", line 1, in <module>
        u*F + v*G###line 596:
    sage: u*F + v*G
    NameError: name 'u' is not defined
**********************************************************************
File "/home/pjeremy/sage-3.4/devel/sage/sage/rings/polynomial/polynomial_integer_dense_flint.pyx", line 604:
    sage: g, u, v = F.xgcd(G)
Exception raised:
    Traceback (most recent call last):
      File "/home/pjeremy/sage-3.4/local/bin/ncadoctest.py", line 1231, in run_one_test
        self.run_one_example(test, example, filename, compileflags)
      File "/home/pjeremy/sage-3.4/local/bin/sagedoctest.py", line 38, in run_one_example
        OrigDocTestRunner.run_one_example(self, test, example, filename, compileflags)
      File "/home/pjeremy/sage-3.4/local/bin/ncadoctest.py", line 1172, in run_one_example
        compileflags, 1) in test.globs
      File "<doctest __main__.example_20[11]>", line 1, in <module>
        g, u, v = F.xgcd(G)###line 604:
    sage: g, u, v = F.xgcd(G)
    RuntimeError
**********************************************************************
File "/home/pjeremy/sage-3.4/devel/sage/sage/rings/polynomial/polynomial_integer_dense_flint.pyx", line 605:
    sage: g, u, v
Exception raised:
    Traceback (most recent call last):
      File "/home/pjeremy/sage-3.4/local/bin/ncadoctest.py", line 1231, in run_one_test
        self.run_one_example(test, example, filename, compileflags)
      File "/home/pjeremy/sage-3.4/local/bin/sagedoctest.py", line 38, in run_one_example
        OrigDocTestRunner.run_one_example(self, test, example, filename, compileflags)
      File "/home/pjeremy/sage-3.4/local/bin/ncadoctest.py", line 1172, in run_one_example
        compileflags, 1) in test.globs
      File "<doctest __main__.example_20[12]>", line 1, in <module>
        g, u, v###line 605:
    sage: g, u, v
    NameError: name 'g' is not defined
**********************************************************************
File "/home/pjeremy/sage-3.4/devel/sage/sage/rings/polynomial/polynomial_integer_dense_flint.pyx", line 607:
    sage: u*F + v*G
Exception raised:
    Traceback (most recent call last):
      File "/home/pjeremy/sage-3.4/local/bin/ncadoctest.py", line 1231, in run_one_test
        self.run_one_example(test, example, filename, compileflags)
      File "/home/pjeremy/sage-3.4/local/bin/sagedoctest.py", line 38, in run_one_example
        OrigDocTestRunner.run_one_example(self, test, example, filename, compileflags)
      File "/home/pjeremy/sage-3.4/local/bin/ncadoctest.py", line 1172, in run_one_example
        compileflags, 1) in test.globs
      File "<doctest __main__.example_20[13]>", line 1, in <module>
        u*F + v*G###line 607:
    sage: u*F + v*G
    NameError: name 'u' is not defined
**********************************************************************
File "/home/pjeremy/sage-3.4/devel/sage/sage/rings/polynomial/polynomial_integer_dense_flint.pyx", line 1167:
    sage: r = f.resultant(g); r
Exception raised:
    Traceback (most recent call last):
      File "/home/pjeremy/sage-3.4/local/bin/ncadoctest.py", line 1231, in run_one_test
        self.run_one_example(test, example, filename, compileflags)
      File "/home/pjeremy/sage-3.4/local/bin/sagedoctest.py", line 38, in run_one_example
        OrigDocTestRunner.run_one_example(self, test, example, filename, compileflags)
      File "/home/pjeremy/sage-3.4/local/bin/ncadoctest.py", line 1172, in run_one_example
        compileflags, 1) in test.globs
      File "<doctest __main__.example_39[4]>", line 1, in <module>
        r = f.resultant(g); r###line 1167:
    sage: r = f.resultant(g); r
    RuntimeError
**********************************************************************
File "/home/pjeremy/sage-3.4/devel/sage/sage/rings/polynomial/polynomial_integer_dense_flint.pyx", line 1169:
    sage: r.parent() is ZZ
Expected:
    True
Got:
    False
**********************************************************************
2 items had failures:
   6 of  14 in __main__.example_20
   2 of   6 in __main__.example_39
***Test Failed*** 8 failures.
Warning: FLINT stack memory allocation cleanup detected mismatched allocation/releases
Warning: FLINT stack memory allocation cleanup detected mismatched allocation/releases
Warning: FLINT stack memory allocation cleanup detected mismatched allocation/releases
For whitespace errors, see the file /home/pjeremy/sage-3.4/tmp/.doctest_polynomial_integer_dense_flint.py
         [4.7 s]

sage -t "devel/sage/sage/rings/integer.pyx"

**********************************************************************
File "/home/pjeremy/sage-3.4/devel/sage/sage/rings/integer.pyx", line 1388:
    sage: 2^float(1.5)       # python float
Expected:
    2.8284271247461903
Got:
    2.8284271247461898
**********************************************************************
1 items had failures:
   1 of  26 in __main__.example_34
***Test Failed*** 1 failures.
For whitespace errors, see the file /home/pjeremy/sage-3.4/tmp/.doctest_integer.py
         [11.7 s]

sage -t "devel/sage/sage/rings/tests.py"

**********************************************************************
File "/home/pjeremy/sage-3.4/devel/sage/sage/rings/tests.py", line 222:
    sage: sage.rings.tests.test_random_elements(trials=10)
Exception raised:
    Traceback (most recent call last):
      File "/home/pjeremy/sage-3.4/local/bin/ncadoctest.py", line 1231, in run_one_test
        self.run_one_example(test, example, filename, compileflags)
      File "/home/pjeremy/sage-3.4/local/bin/sagedoctest.py", line 38, in run_one_example
        OrigDocTestRunner.run_one_example(self, test, example, filename, compileflags)
      File "/home/pjeremy/sage-3.4/local/bin/ncadoctest.py", line 1172, in run_one_example
        compileflags, 1) in test.globs
      File "<doctest __main__.example_11[2]>", line 1, in <module>
        sage.rings.tests.test_random_elements(trials=Integer(10))###line 222:
    sage: sage.rings.tests.test_random_elements(trials=10)
      File "/home/pjeremy/sage-3.4/local/lib/python2.5/site-packages/sage/rings/tests.py", line 230, in test_random_elements
        print "survived %s tests (memory usage = %s)"%(i, get_memory_usage())
      File "/home/pjeremy/sage-3.4/local/lib/python2.5/site-packages/sage/misc/getusage.py", line 81, in get_memory_usage
        raise NotImplementedError, "memory usage not implemented on platform %s"%U
    NotImplementedError: memory usage not implemented on platform freebsd
**********************************************************************
File "/home/pjeremy/sage-3.4/devel/sage/sage/rings/tests.py", line 249:
    sage: sage.rings.tests.test_random_arith(trials=10)
Exception raised:
    Traceback (most recent call last):
      File "/home/pjeremy/sage-3.4/local/bin/ncadoctest.py", line 1231, in run_one_test
        self.run_one_example(test, example, filename, compileflags)
      File "/home/pjeremy/sage-3.4/local/bin/sagedoctest.py", line 38, in run_one_example
        OrigDocTestRunner.run_one_example(self, test, example, filename, compileflags)
      File "/home/pjeremy/sage-3.4/local/bin/ncadoctest.py", line 1172, in run_one_example
        compileflags, 1) in test.globs
      File "<doctest __main__.example_12[2]>", line 1, in <module>
        sage.rings.tests.test_random_arith(trials=Integer(10))###line 249:
    sage: sage.rings.tests.test_random_arith(trials=10)
      File "/home/pjeremy/sage-3.4/local/lib/python2.5/site-packages/sage/rings/tests.py", line 256, in test_random_arith
        print "survived %s tests (memory usage = %s)"%(i, get_memory_usage())
      File "/home/pjeremy/sage-3.4/local/lib/python2.5/site-packages/sage/misc/getusage.py", line 81, in get_memory_usage
        raise NotImplementedError, "memory usage not implemented on platform %s"%U
    NotImplementedError: memory usage not implemented on platform freebsd
**********************************************************************
2 items had failures:
   1 of   3 in __main__.example_11
   1 of   3 in __main__.example_12
***Test Failed*** 2 failures.
For whitespace errors, see the file /home/pjeremy/sage-3.4/tmp/.doctest_tests.py
         [2.5 s]

sage -t "devel/sage/sage/rings/real_double.pyx"

**********************************************************************
File "/home/pjeremy/sage-3.4/devel/sage/sage/rings/real_double.pyx", line 727:
    sage: sage_input(RDF(-e), verify=True, preparse=False)
Expected:
    # Verified
    -RDF(2.7182818284590451)
Got:
    # Verified
    -RDF(2.7182818284590455)
**********************************************************************
1 items had failures:
   1 of  12 in __main__.example_40
***Test Failed*** 1 failures.
For whitespace errors, see the file /home/pjeremy/sage-3.4/tmp/.doctest_real_double.py
         [3.6 s]

sage -t "devel/sage/sage/lfunctions/sympow.py"

**********************************************************************
File "/home/pjeremy/sage-3.4/devel/sage/sage/lfunctions/sympow.py", line 265:
    sage: sympow.analytic_rank(EllipticCurve('11a'))
Exception raised:
    Traceback (most recent call last):
      File "/home/pjeremy/sage-3.4/local/bin/ncadoctest.py", line 1231, in run_one_test
        self.run_one_example(test, example, filename, compileflags)
      File "/home/pjeremy/sage-3.4/local/bin/sagedoctest.py", line 38, in run_one_example
        OrigDocTestRunner.run_one_example(self, test, example, filename, compileflags)
      File "/home/pjeremy/sage-3.4/local/bin/ncadoctest.py", line 1172, in run_one_example
        compileflags, 1) in test.globs
      File "<doctest __main__.example_7[2]>", line 1, in <module>
        sympow.analytic_rank(EllipticCurve('11a'))###line 265:
    sage: sympow.analytic_rank(EllipticCurve('11a'))
      File "/home/pjeremy/sage-3.4/local/lib/python2.5/site-packages/sage/lfunctions/sympow.py", line 287, in analytic_rank
        raise RuntimeError, "failed to compute analytic rank"
    RuntimeError: failed to compute analytic rank
**********************************************************************
File "/home/pjeremy/sage-3.4/devel/sage/sage/lfunctions/sympow.py", line 269:
    sage: sympow.analytic_rank(EllipticCurve('389a'))
Exception raised:
    Traceback (most recent call last):
      File "/home/pjeremy/sage-3.4/local/bin/ncadoctest.py", line 1231, in run_one_test
        self.run_one_example(test, example, filename, compileflags)
      File "/home/pjeremy/sage-3.4/local/bin/sagedoctest.py", line 38, in run_one_example
        OrigDocTestRunner.run_one_example(self, test, example, filename, compileflags)
      File "/home/pjeremy/sage-3.4/local/bin/ncadoctest.py", line 1172, in run_one_example
        compileflags, 1) in test.globs
      File "<doctest __main__.example_7[4]>", line 1, in <module>
        sympow.analytic_rank(EllipticCurve('389a'))###line 269:
    sage: sympow.analytic_rank(EllipticCurve('389a'))
      File "/home/pjeremy/sage-3.4/local/lib/python2.5/site-packages/sage/lfunctions/sympow.py", line 287, in analytic_rank
        raise RuntimeError, "failed to compute analytic rank"
    RuntimeError: failed to compute analytic rank
**********************************************************************
File "/home/pjeremy/sage-3.4/devel/sage/sage/lfunctions/sympow.py", line 273:
    sage: sympow.analytic_rank(EllipticCurve([1, -1, 0, -79, 289]))
Exception raised:
    Traceback (most recent call last):
      File "/home/pjeremy/sage-3.4/local/bin/ncadoctest.py", line 1231, in run_one_test
        self.run_one_example(test, example, filename, compileflags)
      File "/home/pjeremy/sage-3.4/local/bin/sagedoctest.py", line 38, in run_one_example
        OrigDocTestRunner.run_one_example(self, test, example, filename, compileflags)
      File "/home/pjeremy/sage-3.4/local/bin/ncadoctest.py", line 1172, in run_one_example
        compileflags, 1) in test.globs
      File "<doctest __main__.example_7[6]>", line 1, in <module>
        sympow.analytic_rank(EllipticCurve([Integer(1), -Integer(1), Integer(0), -Integer(79), Integer(289)]))###line 273:
    sage: sympow.analytic_rank(EllipticCurve([1, -1, 0, -79, 289]))
      File "/home/pjeremy/sage-3.4/local/lib/python2.5/site-packages/sage/lfunctions/sympow.py", line 287, in analytic_rank
        raise RuntimeError, "failed to compute analytic rank"
    RuntimeError: failed to compute analytic rank
**********************************************************************
File "/home/pjeremy/sage-3.4/devel/sage/sage/lfunctions/sympow.py", line 277:
    sage: sympow.analytic_rank(EllipticCurve([1, 1, 0, -2582, 48720]))  # long
Exception raised:
    Traceback (most recent call last):
      File "/home/pjeremy/sage-3.4/local/bin/ncadoctest.py", line 1231, in run_one_test
        self.run_one_example(test, example, filename, compileflags)
      File "/home/pjeremy/sage-3.4/local/bin/sagedoctest.py", line 38, in run_one_example
        OrigDocTestRunner.run_one_example(self, test, example, filename, compileflags)
      File "/home/pjeremy/sage-3.4/local/bin/ncadoctest.py", line 1172, in run_one_example
        compileflags, 1) in test.globs
      File "<doctest __main__.example_7[8]>", line 1, in <module>
        sympow.analytic_rank(EllipticCurve([Integer(1), Integer(1), Integer(0), -Integer(2582), Integer(48720)]))  # long###line 277:
    sage: sympow.analytic_rank(EllipticCurve([1, 1, 0, -2582, 48720]))  # long
      File "/home/pjeremy/sage-3.4/local/lib/python2.5/site-packages/sage/lfunctions/sympow.py", line 287, in analytic_rank
        raise RuntimeError, "failed to compute analytic rank"
    RuntimeError: failed to compute analytic rank
**********************************************************************
1 items had failures:
   4 of  10 in __main__.example_7
***Test Failed*** 4 failures.
For whitespace errors, see the file /home/pjeremy/sage-3.4/tmp/.doctest_sympow.py
         [13.6 s]

sage -t "devel/sage/sage/combinat/partition.py"

**********************************************************************
File "/home/pjeremy/sage-3.4/devel/sage/sage/combinat/partition.py", line 3390:
    sage: number_of_partitions( n - (n % 385) + 369) % 385 == 0
Expected:
    True
Got:
    False
**********************************************************************
File "/home/pjeremy/sage-3.4/devel/sage/sage/combinat/partition.py", line 3393:
    sage: number_of_partitions( n - (n % 385) + 369) % 385 == 0
Expected:
    True
Got:
    False
**********************************************************************
File "/home/pjeremy/sage-3.4/devel/sage/sage/combinat/partition.py", line 3396:
    sage: number_of_partitions( n - (n % 385) + 369) % 385 == 0
Expected:
    True
Got:
    False
**********************************************************************
File "/home/pjeremy/sage-3.4/devel/sage/sage/combinat/partition.py", line 3399:
    sage: number_of_partitions( n - (n % 385) + 369) % 385 == 0
Expected:
    True
Got:
    False
**********************************************************************
File "/home/pjeremy/sage-3.4/devel/sage/sage/combinat/partition.py", line 3402:
    sage: number_of_partitions( n - (n % 385) + 369) % 385 == 0
Expected:
    True
Got:
    False
**********************************************************************
File "/home/pjeremy/sage-3.4/devel/sage/sage/combinat/partition.py", line 3405:
    sage: number_of_partitions( n - (n % 385) + 369) % 385 == 0
Expected:
    True
Got:
    False
**********************************************************************
File "/home/pjeremy/sage-3.4/devel/sage/sage/combinat/partition.py", line 3408:
    sage: number_of_partitions( n - (n % 385) + 369) % 385 == 0
Expected:
    True
Got:
    False
**********************************************************************
File "/home/pjeremy/sage-3.4/devel/sage/sage/combinat/partition.py", line 3416:
    sage: len([n for n in [1..500] if number_of_partitions(n) != number_of_partitions(n,algorithm='pari')])
Expected:
    0
Got:
    23
**********************************************************************
1 items had failures:
   8 of  40 in __main__.example_125
***Test Failed*** 8 failures.
For whitespace errors, see the file /home/pjeremy/sage-3.4/tmp/.doctest_partition.py
         [23.5 s]

sage -t "devel/sage/sage/calculus/calculus.py"

**********************************************************************
File "/home/pjeremy/sage-3.4/devel/sage/sage/calculus/calculus.py", line 3161:
    sage: numerical_integral(f, 0, 1)
Expected:
    (0.52848223225314706, 6.8392846084921134e-07)
Got:
    (0.52848223225314706, 6.8392846084921049e-07)
**********************************************************************
File "/home/pjeremy/sage-3.4/devel/sage/sage/calculus/calculus.py", line 3792:
    sage: a.find_root(0,0.002)
Expected:
    0.0004110514049349341...
Got:
    0.00041105140493493428
**********************************************************************
2 items had failures:
   1 of  16 in __main__.example_73
   1 of  25 in __main__.example_84
***Test Failed*** 2 failures.
For whitespace errors, see the file /home/pjeremy/sage-3.4/tmp/.doctest_calculus.py
         [84.3 s]

sage -t "devel/sage/sage/plot/plot3d/shapes2.py"

**********************************************************************
File "/home/pjeremy/sage-3.4/devel/sage/sage/plot/plot3d/shapes2.py", line 65:
    sage: line3d([(0,0,0), (1,1,1), (1,0,2)], opacity=0.5, radius=0.1, color='green') + line3d([(0,1,0), (1,0,2)])
Exception raised:
    Traceback (most recent call last):
      File "/home/pjeremy/sage-3.4/local/bin/ncadoctest.py", line 1231, in run_one_test
        self.run_one_example(test, example, filename, compileflags)
      File "/home/pjeremy/sage-3.4/local/bin/sagedoctest.py", line 38, in run_one_example
        OrigDocTestRunner.run_one_example(self, test, example, filename, compileflags)
      File "/home/pjeremy/sage-3.4/local/bin/ncadoctest.py", line 1172, in run_one_example
        compileflags, 1) in test.globs
      File "<doctest __main__.example_1[4]>", line 1, in <module>
        line3d([(Integer(0),Integer(0),Integer(0)), (Integer(1),Integer(1),Integer(1)), (Integer(1),Integer(0),Integer(2))], opacity=RealNumber('0.5'), radius=RealNumber('0.1'), color='green') + line3d([(Integer(0),Integer(1),Integer(0)), (Integer(1),Integer(0),Integer(2))])###line 65:
    sage: line3d([(0,0,0), (1,1,1), (1,0,2)], opacity=0.5, radius=0.1, color='green') + line3d([(0,1,0), (1,0,2)])
      File "base.pyx", line 62, in sage.plot.plot3d.base.Graphics3d.__repr__ (sage/plot/plot3d/base.c:1973)
      File "base.pyx", line 537, in sage.plot.plot3d.base.Graphics3d.show (sage/plot/plot3d/base.c:8561)
      File "base.pyx", line 205, in sage.plot.plot3d.base.Graphics3d.tachyon (sage/plot/plot3d/base.c:3815)
      File "base.pyx", line 211, in sage.plot.plot3d.base.Graphics3d.tachyon_str (sage/plot/plot3d/base.c:3878)
      File "base.pyx", line 619, in sage.plot.plot3d.base.Graphics3dGroup.tachyon_repr (sage/plot/plot3d/base.c:9930)
      File "base.pyx", line 694, in sage.plot.plot3d.base.TransformGroup.tachyon_repr (sage/plot/plot3d/base.c:11703)
      File "base.pyx", line 694, in sage.plot.plot3d.base.TransformGroup.tachyon_repr (sage/plot/plot3d/base.c:11703)
      File "base.pyx", line 619, in sage.plot.plot3d.base.Graphics3dGroup.tachyon_repr (sage/plot/plot3d/base.c:9930)
      File "base.pyx", line 694, in sage.plot.plot3d.base.TransformGroup.tachyon_repr (sage/plot/plot3d/base.c:11703)
      File "base.pyx", line 694, in sage.plot.plot3d.base.TransformGroup.tachyon_repr (sage/plot/plot3d/base.c:11703)
      File "shapes.pyx", line 188, in sage.plot.plot3d.shapes.Cylinder.tachyon_repr (sage/plot/plot3d/shapes.c:2702)
      File "parametric_surface.pyx", line 132, in sage.plot.plot3d.parametric_surface.ParametricSurface.tachyon_repr (sage/plot/plot3d/parametric_surface.c:1826)
    RuntimeError
**********************************************************************
1 items had failures:
   1 of  14 in __main__.example_1
***Test Failed*** 1 failures.
For whitespace errors, see the file /home/pjeremy/sage-3.4/tmp/.doctest_shapes2.py
         [5.1 s]

sage -t "devel/sage/sage/plot/plot3d/shapes.pyx"

**********************************************************************
File "/home/pjeremy/sage-3.4/devel/sage/sage/plot/plot3d/shapes.pyx", line 16:
    sage: S.show()
Exception raised:
    Traceback (most recent call last):
      File "/home/pjeremy/sage-3.4/local/bin/ncadoctest.py", line 1231, in run_one_test
        self.run_one_example(test, example, filename, compileflags)
      File "/home/pjeremy/sage-3.4/local/bin/sagedoctest.py", line 38, in run_one_example
        OrigDocTestRunner.run_one_example(self, test, example, filename, compileflags)
      File "/home/pjeremy/sage-3.4/local/bin/ncadoctest.py", line 1172, in run_one_example
        compileflags, 1) in test.globs
      File "<doctest __main__.example_0[8]>", line 1, in <module>
        S.show()###line 16:
    sage: S.show()
      File "base.pyx", line 537, in sage.plot.plot3d.base.Graphics3d.show (sage/plot/plot3d/base.c:8561)
      File "base.pyx", line 205, in sage.plot.plot3d.base.Graphics3d.tachyon (sage/plot/plot3d/base.c:3815)
      File "base.pyx", line 211, in sage.plot.plot3d.base.Graphics3d.tachyon_str (sage/plot/plot3d/base.c:3878)
      File "base.pyx", line 619, in sage.plot.plot3d.base.Graphics3dGroup.tachyon_repr (sage/plot/plot3d/base.c:9930)
      File "base.pyx", line 694, in sage.plot.plot3d.base.TransformGroup.tachyon_repr (sage/plot/plot3d/base.c:11703)
      File "base.pyx", line 694, in sage.plot.plot3d.base.TransformGroup.tachyon_repr (sage/plot/plot3d/base.c:11703)
      File "base.pyx", line 619, in sage.plot.plot3d.base.Graphics3dGroup.tachyon_repr (sage/plot/plot3d/base.c:9930)
      File "base.pyx", line 619, in sage.plot.plot3d.base.Graphics3dGroup.tachyon_repr (sage/plot/plot3d/base.c:9930)
      File "base.pyx", line 619, in sage.plot.plot3d.base.Graphics3dGroup.tachyon_repr (sage/plot/plot3d/base.c:9930)
      File "base.pyx", line 694, in sage.plot.plot3d.base.TransformGroup.tachyon_repr (sage/plot/plot3d/base.c:11703)
      File "parametric_surface.pyx", line 132, in sage.plot.plot3d.parametric_surface.ParametricSurface.tachyon_repr (sage/plot/plot3d/parametric_surface.c:1826)
    RuntimeError
**********************************************************************
File "/home/pjeremy/sage-3.4/devel/sage/sage/plot/plot3d/shapes.pyx", line 17:
    sage: S.scale(1,1,2).show()
Exception raised:
    Traceback (most recent call last):
      File "/home/pjeremy/sage-3.4/local/bin/ncadoctest.py", line 1231, in run_one_test
        self.run_one_example(test, example, filename, compileflags)
      File "/home/pjeremy/sage-3.4/local/bin/sagedoctest.py", line 38, in run_one_example
        OrigDocTestRunner.run_one_example(self, test, example, filename, compileflags)
      File "/home/pjeremy/sage-3.4/local/bin/ncadoctest.py", line 1172, in run_one_example
        compileflags, 1) in test.globs
      File "<doctest __main__.example_0[9]>", line 1, in <module>
        S.scale(Integer(1),Integer(1),Integer(2)).show()###line 17:
    sage: S.scale(1,1,2).show()
      File "base.pyx", line 537, in sage.plot.plot3d.base.Graphics3d.show (sage/plot/plot3d/base.c:8561)
      File "base.pyx", line 205, in sage.plot.plot3d.base.Graphics3d.tachyon (sage/plot/plot3d/base.c:3815)
      File "base.pyx", line 211, in sage.plot.plot3d.base.Graphics3d.tachyon_str (sage/plot/plot3d/base.c:3878)
      File "base.pyx", line 619, in sage.plot.plot3d.base.Graphics3dGroup.tachyon_repr (sage/plot/plot3d/base.c:9930)
      File "base.pyx", line 694, in sage.plot.plot3d.base.TransformGroup.tachyon_repr (sage/plot/plot3d/base.c:11703)
      File "base.pyx", line 694, in sage.plot.plot3d.base.TransformGroup.tachyon_repr (sage/plot/plot3d/base.c:11703)
      File "base.pyx", line 694, in sage.plot.plot3d.base.TransformGroup.tachyon_repr (sage/plot/plot3d/base.c:11703)
      File "base.pyx", line 619, in sage.plot.plot3d.base.Graphics3dGroup.tachyon_repr (sage/plot/plot3d/base.c:9930)
      File "base.pyx", line 619, in sage.plot.plot3d.base.Graphics3dGroup.tachyon_repr (sage/plot/plot3d/base.c:9930)
      File "base.pyx", line 619, in sage.plot.plot3d.base.Graphics3dGroup.tachyon_repr (sage/plot/plot3d/base.c:9930)
      File "base.pyx", line 694, in sage.plot.plot3d.base.TransformGroup.tachyon_repr (sage/plot/plot3d/base.c:11703)
      File "parametric_surface.pyx", line 132, in sage.plot.plot3d.parametric_surface.ParametricSurface.tachyon_repr (sage/plot/plot3d/parametric_surface.c:1826)
    RuntimeError
**********************************************************************
File "/home/pjeremy/sage-3.4/devel/sage/sage/plot/plot3d/shapes.pyx", line 324:
    sage: arrow3d((0,0,0), (1,1,1), radius=0.1)
Exception raised:
    Traceback (most recent call last):
      File "/home/pjeremy/sage-3.4/local/bin/ncadoctest.py", line 1231, in run_one_test
        self.run_one_example(test, example, filename, compileflags)
      File "/home/pjeremy/sage-3.4/local/bin/sagedoctest.py", line 38, in run_one_example
        OrigDocTestRunner.run_one_example(self, test, example, filename, compileflags)
      File "/home/pjeremy/sage-3.4/local/bin/ncadoctest.py", line 1172, in run_one_example
        compileflags, 1) in test.globs
      File "<doctest __main__.example_9[3]>", line 1, in <module>
        arrow3d((Integer(0),Integer(0),Integer(0)), (Integer(1),Integer(1),Integer(1)), radius=RealNumber('0.1'))###line 324:
    sage: arrow3d((0,0,0), (1,1,1), radius=0.1)
      File "base.pyx", line 62, in sage.plot.plot3d.base.Graphics3d.__repr__ (sage/plot/plot3d/base.c:1973)
      File "base.pyx", line 537, in sage.plot.plot3d.base.Graphics3d.show (sage/plot/plot3d/base.c:8561)
      File "base.pyx", line 205, in sage.plot.plot3d.base.Graphics3d.tachyon (sage/plot/plot3d/base.c:3815)
      File "base.pyx", line 211, in sage.plot.plot3d.base.Graphics3d.tachyon_str (sage/plot/plot3d/base.c:3878)
      File "base.pyx", line 619, in sage.plot.plot3d.base.Graphics3dGroup.tachyon_repr (sage/plot/plot3d/base.c:9930)
      File "base.pyx", line 694, in sage.plot.plot3d.base.TransformGroup.tachyon_repr (sage/plot/plot3d/base.c:11703)
      File "base.pyx", line 694, in sage.plot.plot3d.base.TransformGroup.tachyon_repr (sage/plot/plot3d/base.c:11703)
      File "base.pyx", line 694, in sage.plot.plot3d.base.TransformGroup.tachyon_repr (sage/plot/plot3d/base.c:11703)
      File "base.pyx", line 694, in sage.plot.plot3d.base.TransformGroup.tachyon_repr (sage/plot/plot3d/base.c:11703)
      File "shapes.pyx", line 188, in sage.plot.plot3d.shapes.Cylinder.tachyon_repr (sage/plot/plot3d/shapes.c:2702)
      File "parametric_surface.pyx", line 132, in sage.plot.plot3d.parametric_surface.ParametricSurface.tachyon_repr (sage/plot/plot3d/parametric_surface.c:1826)
    RuntimeError
**********************************************************************
File "/home/pjeremy/sage-3.4/devel/sage/sage/plot/plot3d/shapes.pyx", line 330:
    sage: arrow3d((2,1,0), (1,1,1), color='green', head_radius=0.3, aspect_ratio=[1,1,1])
Exception raised:
    Traceback (most recent call last):
      File "/home/pjeremy/sage-3.4/local/bin/ncadoctest.py", line 1231, in run_one_test
        self.run_one_example(test, example, filename, compileflags)
      File "/home/pjeremy/sage-3.4/local/bin/sagedoctest.py", line 38, in run_one_example
        OrigDocTestRunner.run_one_example(self, test, example, filename, compileflags)
      File "/home/pjeremy/sage-3.4/local/bin/ncadoctest.py", line 1172, in run_one_example
        compileflags, 1) in test.globs
      File "<doctest __main__.example_9[5]>", line 1, in <module>
        arrow3d((Integer(2),Integer(1),Integer(0)), (Integer(1),Integer(1),Integer(1)), color='green', head_radius=RealNumber('0.3'), aspect_ratio=[Integer(1),Integer(1),Integer(1)])###line 330:
    sage: arrow3d((2,1,0), (1,1,1), color='green', head_radius=0.3, aspect_ratio=[1,1,1])
      File "base.pyx", line 62, in sage.plot.plot3d.base.Graphics3d.__repr__ (sage/plot/plot3d/base.c:1973)
      File "base.pyx", line 568, in sage.plot.plot3d.base.Graphics3d.show (sage/plot/plot3d/base.c:9028)
      File "base.pyx", line 237, in sage.plot.plot3d.base.Graphics3d.export_jmol (sage/plot/plot3d/base.c:4263)
      File "base.pyx", line 628, in sage.plot.plot3d.base.Graphics3dGroup.jmol_repr (sage/plot/plot3d/base.c:10275)
      File "base.pyx", line 706, in sage.plot.plot3d.base.TransformGroup.jmol_repr (sage/plot/plot3d/base.c:12049)
      File "base.pyx", line 706, in sage.plot.plot3d.base.TransformGroup.jmol_repr (sage/plot/plot3d/base.c:12049)
      File "base.pyx", line 706, in sage.plot.plot3d.base.TransformGroup.jmol_repr (sage/plot/plot3d/base.c:12049)
      File "base.pyx", line 706, in sage.plot.plot3d.base.TransformGroup.jmol_repr (sage/plot/plot3d/base.c:12049)
      File "base.pyx", line 706, in sage.plot.plot3d.base.TransformGroup.jmol_repr (sage/plot/plot3d/base.c:12049)
      File "parametric_surface.pyx", line 140, in sage.plot.plot3d.parametric_surface.ParametricSurface.jmol_repr (sage/plot/plot3d/parametric_surface.c:1954)
      File "index_face_set.pyx", line 616, in sage.plot.plot3d.index_face_set.IndexFaceSet.jmol_repr (sage/plot/plot3d/index_face_set.c:6298)
    RuntimeError
**********************************************************************
2 items had failures:
   2 of  12 in __main__.example_0
   2 of  12 in __main__.example_9
***Test Failed*** 4 failures.
For whitespace errors, see the file /home/pjeremy/sage-3.4/tmp/.doctest_shapes.py
         [7.6 s]

sage -t "devel/sage/sage/plot/plot3d/plot3d.py"

**********************************************************************
File "/home/pjeremy/sage-3.4/devel/sage/sage/plot/plot3d/plot3d.py", line 10:
    sage: P.show()
Exception raised:
    Traceback (most recent call last):
      File "/home/pjeremy/sage-3.4/local/bin/ncadoctest.py", line 1231, in run_one_test
        self.run_one_example(test, example, filename, compileflags)
      File "/home/pjeremy/sage-3.4/local/bin/sagedoctest.py", line 38, in run_one_example
        OrigDocTestRunner.run_one_example(self, test, example, filename, compileflags)
      File "/home/pjeremy/sage-3.4/local/bin/ncadoctest.py", line 1172, in run_one_example
        compileflags, 1) in test.globs
      File "<doctest __main__.example_0[4]>", line 1, in <module>
        P.show()###line 10:
    sage: P.show()
      File "base.pyx", line 537, in sage.plot.plot3d.base.Graphics3d.show (sage/plot/plot3d/base.c:8561)
      File "base.pyx", line 205, in sage.plot.plot3d.base.Graphics3d.tachyon (sage/plot/plot3d/base.c:3815)
      File "base.pyx", line 211, in sage.plot.plot3d.base.Graphics3d.tachyon_str (sage/plot/plot3d/base.c:3878)
      File "base.pyx", line 619, in sage.plot.plot3d.base.Graphics3dGroup.tachyon_repr (sage/plot/plot3d/base.c:9930)
      File "base.pyx", line 694, in sage.plot.plot3d.base.TransformGroup.tachyon_repr (sage/plot/plot3d/base.c:11703)
      File "base.pyx", line 694, in sage.plot.plot3d.base.TransformGroup.tachyon_repr (sage/plot/plot3d/base.c:11703)
    RuntimeError
**********************************************************************
File "/home/pjeremy/sage-3.4/devel/sage/sage/plot/plot3d/plot3d.py", line 39:
    sage: cape_man.show(aspect_ratio=[1,1,1])
Exception raised:
    Traceback (most recent call last):
      File "/home/pjeremy/sage-3.4/local/bin/ncadoctest.py", line 1231, in run_one_test
        self.run_one_example(test, example, filename, compileflags)
      File "/home/pjeremy/sage-3.4/local/bin/sagedoctest.py", line 38, in run_one_example
        OrigDocTestRunner.run_one_example(self, test, example, filename, compileflags)
      File "/home/pjeremy/sage-3.4/local/bin/ncadoctest.py", line 1172, in run_one_example
        compileflags, 1) in test.globs
      File "<doctest __main__.example_0[19]>", line 1, in <module>
        cape_man.show(aspect_ratio=[Integer(1),Integer(1),Integer(1)])###line 39:
    sage: cape_man.show(aspect_ratio=[1,1,1])
      File "base.pyx", line 537, in sage.plot.plot3d.base.Graphics3d.show (sage/plot/plot3d/base.c:8561)
      File "base.pyx", line 205, in sage.plot.plot3d.base.Graphics3d.tachyon (sage/plot/plot3d/base.c:3815)
      File "base.pyx", line 211, in sage.plot.plot3d.base.Graphics3d.tachyon_str (sage/plot/plot3d/base.c:3878)
      File "base.pyx", line 619, in sage.plot.plot3d.base.Graphics3dGroup.tachyon_repr (sage/plot/plot3d/base.c:9930)
      File "base.pyx", line 694, in sage.plot.plot3d.base.TransformGroup.tachyon_repr (sage/plot/plot3d/base.c:11703)
      File "base.pyx", line 694, in sage.plot.plot3d.base.TransformGroup.tachyon_repr (sage/plot/plot3d/base.c:11703)
      File "base.pyx", line 694, in sage.plot.plot3d.base.TransformGroup.tachyon_repr (sage/plot/plot3d/base.c:11703)
      File "base.pyx", line 619, in sage.plot.plot3d.base.Graphics3dGroup.tachyon_repr (sage/plot/plot3d/base.c:9930)
      File "base.pyx", line 619, in sage.plot.plot3d.base.Graphics3dGroup.tachyon_repr (sage/plot/plot3d/base.c:9930)
      File "base.pyx", line 619, in sage.plot.plot3d.base.Graphics3dGroup.tachyon_repr (sage/plot/plot3d/base.c:9930)
      File "base.pyx", line 694, in sage.plot.plot3d.base.TransformGroup.tachyon_repr (sage/plot/plot3d/base.c:11703)
      File "parametric_surface.pyx", line 132, in sage.plot.plot3d.parametric_surface.ParametricSurface.tachyon_repr (sage/plot/plot3d/parametric_surface.c:1826)
    RuntimeError
**********************************************************************
File "/home/pjeremy/sage-3.4/devel/sage/sage/plot/plot3d/plot3d.py", line 123:
    sage: plot3d(lambda x, y: x^2 + y^2, (-2,2), (-2,2), adaptive=True)
Exception raised:
    Traceback (most recent call last):
      File "/home/pjeremy/sage-3.4/local/bin/ncadoctest.py", line 1231, in run_one_test
        self.run_one_example(test, example, filename, compileflags)
      File "/home/pjeremy/sage-3.4/local/bin/sagedoctest.py", line 38, in run_one_example
        OrigDocTestRunner.run_one_example(self, test, example, filename, compileflags)
      File "/home/pjeremy/sage-3.4/local/bin/ncadoctest.py", line 1172, in run_one_example
        compileflags, 1) in test.globs
      File "<doctest __main__.example_1[3]>", line 1, in <module>
        plot3d(lambda x, y: x**Integer(2) + y**Integer(2), (-Integer(2),Integer(2)), (-Integer(2),Integer(2)), adaptive=True)###line 123:
    sage: plot3d(lambda x, y: x^2 + y^2, (-2,2), (-2,2), adaptive=True)
      File "base.pyx", line 62, in sage.plot.plot3d.base.Graphics3d.__repr__ (sage/plot/plot3d/base.c:1973)
      File "base.pyx", line 537, in sage.plot.plot3d.base.Graphics3d.show (sage/plot/plot3d/base.c:8561)
      File "base.pyx", line 205, in sage.plot.plot3d.base.Graphics3d.tachyon (sage/plot/plot3d/base.c:3815)
      File "base.pyx", line 211, in sage.plot.plot3d.base.Graphics3d.tachyon_str (sage/plot/plot3d/base.c:3878)
      File "base.pyx", line 619, in sage.plot.plot3d.base.Graphics3dGroup.tachyon_repr (sage/plot/plot3d/base.c:9930)
      File "base.pyx", line 694, in sage.plot.plot3d.base.TransformGroup.tachyon_repr (sage/plot/plot3d/base.c:11703)
      File "base.pyx", line 694, in sage.plot.plot3d.base.TransformGroup.tachyon_repr (sage/plot/plot3d/base.c:11703)
    RuntimeError
**********************************************************************
File "/home/pjeremy/sage-3.4/devel/sage/sage/plot/plot3d/plot3d.py", line 127:
    sage: plot3d(lambda x, y: x^2 + y^2, (-2,2), (-2,2), adaptive=True, initial_depth=5)
Exception raised:
    Traceback (most recent call last):
      File "/home/pjeremy/sage-3.4/local/bin/ncadoctest.py", line 1231, in run_one_test
        self.run_one_example(test, example, filename, compileflags)
      File "/home/pjeremy/sage-3.4/local/bin/sagedoctest.py", line 38, in run_one_example
        OrigDocTestRunner.run_one_example(self, test, example, filename, compileflags)
      File "/home/pjeremy/sage-3.4/local/bin/ncadoctest.py", line 1172, in run_one_example
        compileflags, 1) in test.globs
      File "<doctest __main__.example_1[4]>", line 1, in <module>
        plot3d(lambda x, y: x**Integer(2) + y**Integer(2), (-Integer(2),Integer(2)), (-Integer(2),Integer(2)), adaptive=True, initial_depth=Integer(5))###line 127:
    sage: plot3d(lambda x, y: x^2 + y^2, (-2,2), (-2,2), adaptive=True, initial_depth=5)
      File "base.pyx", line 62, in sage.plot.plot3d.base.Graphics3d.__repr__ (sage/plot/plot3d/base.c:1973)
      File "base.pyx", line 537, in sage.plot.plot3d.base.Graphics3d.show (sage/plot/plot3d/base.c:8561)
      File "base.pyx", line 205, in sage.plot.plot3d.base.Graphics3d.tachyon (sage/plot/plot3d/base.c:3815)
      File "base.pyx", line 211, in sage.plot.plot3d.base.Graphics3d.tachyon_str (sage/plot/plot3d/base.c:3878)
      File "base.pyx", line 619, in sage.plot.plot3d.base.Graphics3dGroup.tachyon_repr (sage/plot/plot3d/base.c:9930)
      File "base.pyx", line 694, in sage.plot.plot3d.base.TransformGroup.tachyon_repr (sage/plot/plot3d/base.c:11703)
      File "base.pyx", line 694, in sage.plot.plot3d.base.TransformGroup.tachyon_repr (sage/plot/plot3d/base.c:11703)
    RuntimeError
**********************************************************************
File "/home/pjeremy/sage-3.4/devel/sage/sage/plot/plot3d/plot3d.py", line 240:
    sage: x,y=var('x,y'); plot3d_adaptive(sin(x*y), (x,-pi,pi), (y,-pi,pi), initial_depth=5)
Exception raised:
    Traceback (most recent call last):
      File "/home/pjeremy/sage-3.4/local/bin/ncadoctest.py", line 1231, in run_one_test
        self.run_one_example(test, example, filename, compileflags)
      File "/home/pjeremy/sage-3.4/local/bin/sagedoctest.py", line 38, in run_one_example
        OrigDocTestRunner.run_one_example(self, test, example, filename, compileflags)
      File "/home/pjeremy/sage-3.4/local/bin/ncadoctest.py", line 1172, in run_one_example
        compileflags, 1) in test.globs
      File "<doctest __main__.example_2[3]>", line 1, in <module>
        x,y=var('x,y'); plot3d_adaptive(sin(x*y), (x,-pi,pi), (y,-pi,pi), initial_depth=Integer(5))###line 240:
    sage: x,y=var('x,y'); plot3d_adaptive(sin(x*y), (x,-pi,pi), (y,-pi,pi), initial_depth=5)
      File "base.pyx", line 62, in sage.plot.plot3d.base.Graphics3d.__repr__ (sage/plot/plot3d/base.c:1973)
      File "base.pyx", line 537, in sage.plot.plot3d.base.Graphics3d.show (sage/plot/plot3d/base.c:8561)
      File "base.pyx", line 205, in sage.plot.plot3d.base.Graphics3d.tachyon (sage/plot/plot3d/base.c:3815)
      File "base.pyx", line 211, in sage.plot.plot3d.base.Graphics3d.tachyon_str (sage/plot/plot3d/base.c:3878)
      File "base.pyx", line 619, in sage.plot.plot3d.base.Graphics3dGroup.tachyon_repr (sage/plot/plot3d/base.c:9930)
      File "base.pyx", line 694, in sage.plot.plot3d.base.TransformGroup.tachyon_repr (sage/plot/plot3d/base.c:11703)
      File "base.pyx", line 694, in sage.plot.plot3d.base.TransformGroup.tachyon_repr (sage/plot/plot3d/base.c:11703)
    RuntimeError
**********************************************************************
3 items had failures:
   2 of  20 in __main__.example_0
   2 of  24 in __main__.example_1
   1 of   4 in __main__.example_2
***Test Failed*** 5 failures.
For whitespace errors, see the file /home/pjeremy/sage-3.4/tmp/.doctest_plot3d.py
         [6.7 s]

sage -t "devel/sage/sage/plot/plot3d/index_face_set.pyx"

A mysterious error (perphaps a memory error?) occurred, which may have crashed doctest.
         [2.3 s]

sage -t "devel/sage/sage/plot/plot3d/parametric_surface.pyx"

**********************************************************************
File "/home/pjeremy/sage-3.4/devel/sage/sage/plot/plot3d/parametric_surface.pyx", line 19:
    sage: S.show()
Exception raised:
    Traceback (most recent call last):
      File "/home/pjeremy/sage-3.4/local/bin/ncadoctest.py", line 1231, in run_one_test
        self.run_one_example(test, example, filename, compileflags)
      File "/home/pjeremy/sage-3.4/local/bin/sagedoctest.py", line 38, in run_one_example
        OrigDocTestRunner.run_one_example(self, test, example, filename, compileflags)
      File "/home/pjeremy/sage-3.4/local/bin/ncadoctest.py", line 1172, in run_one_example
        compileflags, 1) in test.globs
      File "<doctest __main__.example_0[5]>", line 1, in <module>
        S.show()###line 19:
    sage: S.show()
      File "base.pyx", line 537, in sage.plot.plot3d.base.Graphics3d.show (sage/plot/plot3d/base.c:8561)
      File "base.pyx", line 205, in sage.plot.plot3d.base.Graphics3d.tachyon (sage/plot/plot3d/base.c:3815)
      File "base.pyx", line 211, in sage.plot.plot3d.base.Graphics3d.tachyon_str (sage/plot/plot3d/base.c:3878)
      File "base.pyx", line 619, in sage.plot.plot3d.base.Graphics3dGroup.tachyon_repr (sage/plot/plot3d/base.c:9930)
      File "base.pyx", line 694, in sage.plot.plot3d.base.TransformGroup.tachyon_repr (sage/plot/plot3d/base.c:11703)
      File "base.pyx", line 694, in sage.plot.plot3d.base.TransformGroup.tachyon_repr (sage/plot/plot3d/base.c:11703)
      File "parametric_surface.pyx", line 132, in sage.plot.plot3d.parametric_surface.ParametricSurface.tachyon_repr (sage/plot/plot3d/parametric_surface.c:1826)
    RuntimeError
**********************************************************************
1 items had failures:
   1 of   6 in __main__.example_0
***Test Failed*** 1 failures.
For whitespace errors, see the file /home/pjeremy/sage-3.4/tmp/.doctest_parametric_surface.py
         [4.1 s]

sage -t "devel/sage/sage/schemes/elliptic_curves/ell_rational_field.py"

**********************************************************************
File "/home/pjeremy/sage-3.4/devel/sage/sage/schemes/elliptic_curves/ell_rational_field.py", line 1178:
    sage: E.analytic_rank(algorithm='sympow')
Exception raised:
    Traceback (most recent call last):
      File "/home/pjeremy/sage-3.4/local/bin/ncadoctest.py", line 1231, in run_one_test
        self.run_one_example(test, example, filename, compileflags)
      File "/home/pjeremy/sage-3.4/local/bin/sagedoctest.py", line 38, in run_one_example
        OrigDocTestRunner.run_one_example(self, test, example, filename, compileflags)
      File "/home/pjeremy/sage-3.4/local/bin/ncadoctest.py", line 1172, in run_one_example
        compileflags, 1) in test.globs
      File "<doctest __main__.example_27[5]>", line 1, in <module>
        E.analytic_rank(algorithm='sympow')###line 1178:
    sage: E.analytic_rank(algorithm='sympow')
      File "/home/pjeremy/sage-3.4/local/lib/python2.5/site-packages/sage/schemes/elliptic_curves/ell_rational_field.py", line 1208, in analytic_rank
        return sympow.analytic_rank(self)[0]
      File "/home/pjeremy/sage-3.4/local/lib/python2.5/site-packages/sage/lfunctions/sympow.py", line 287, in analytic_rank
        raise RuntimeError, "failed to compute analytic rank"
    RuntimeError: failed to compute analytic rank
**********************************************************************
File "/home/pjeremy/sage-3.4/devel/sage/sage/schemes/elliptic_curves/ell_rational_field.py", line 1182:
    sage: E.analytic_rank(algorithm='all')
Exception raised:
    Traceback (most recent call last):
      File "/home/pjeremy/sage-3.4/local/bin/ncadoctest.py", line 1231, in run_one_test
        self.run_one_example(test, example, filename, compileflags)
      File "/home/pjeremy/sage-3.4/local/bin/sagedoctest.py", line 38, in run_one_example
        OrigDocTestRunner.run_one_example(self, test, example, filename, compileflags)
      File "/home/pjeremy/sage-3.4/local/bin/ncadoctest.py", line 1172, in run_one_example
        compileflags, 1) in test.globs
      File "<doctest __main__.example_27[6]>", line 1, in <module>
        E.analytic_rank(algorithm='all')###line 1182:
    sage: E.analytic_rank(algorithm='all')
      File "/home/pjeremy/sage-3.4/local/lib/python2.5/site-packages/sage/schemes/elliptic_curves/ell_rational_field.py", line 1214, in analytic_rank
        self.analytic_rank('rubinstein'), self.analytic_rank('sympow')]))
      File "/home/pjeremy/sage-3.4/local/lib/python2.5/site-packages/sage/schemes/elliptic_curves/ell_rational_field.py", line 1208, in analytic_rank
        return sympow.analytic_rank(self)[0]
      File "/home/pjeremy/sage-3.4/local/lib/python2.5/site-packages/sage/lfunctions/sympow.py", line 287, in analytic_rank
        raise RuntimeError, "failed to compute analytic rank"
    RuntimeError: failed to compute analytic rank
**********************************************************************
1 items had failures:
   2 of   9 in __main__.example_27
***Test Failed*** 2 failures.
For whitespace errors, see the file /home/pjeremy/sage-3.4/tmp/.doctest_ell_rational_field.py
         [82.3 s]

sage -t "devel/sage/sage/server/misc.py"

**********************************************************************
File "/home/pjeremy/sage-3.4/devel/sage/sage/server/misc.py", line 88:
    sage: print "ignore this";  sage.server.misc.find_next_available_port(9000, verbose=False)   # random output -- depends on network
Exception raised:
    Traceback (most recent call last):
      File "/home/pjeremy/sage-3.4/local/bin/ncadoctest.py", line 1231, in run_one_test
        self.run_one_example(test, example, filename, compileflags)
      File "/home/pjeremy/sage-3.4/local/bin/sagedoctest.py", line 38, in run_one_example
        OrigDocTestRunner.run_one_example(self, test, example, filename, compileflags)
      File "/home/pjeremy/sage-3.4/local/bin/ncadoctest.py", line 1172, in run_one_example
        compileflags, 1) in test.globs
      File "<doctest __main__.example_2[2]>", line 1, in <module>
        print "ignore this";  sage.server.misc.find_next_available_port(Integer(9000), verbose=False)   # random output -- depends on network###line 88:
    sage: print "ignore this";  sage.server.misc.find_next_available_port(9000, verbose=False)   # random output -- depends on network
      File "/home/pjeremy/sage-3.4/local/lib/python2.5/site-packages/sage/server/misc.py", line 113, in find_next_available_port
        raise RuntimeError, "no available port."
    RuntimeError: no available port.
**********************************************************************
1 items had failures:
   1 of   3 in __main__.example_2
***Test Failed*** 1 failures.
For whitespace errors, see the file /home/pjeremy/sage-3.4/tmp/.doctest_misc.py
         [12.3 s]

sage -t "devel/sage/sage/ext/fast_eval.pyx"

**********************************************************************
File "/home/pjeremy/sage-3.4/devel/sage/sage/ext/fast_eval.pyx", line 934:
    sage: f(9)
Expected:
    2.0
Got:
    2.0000000000000004
**********************************************************************
1 items had failures:
   1 of   9 in __main__.example_22
***Test Failed*** 1 failures.
For whitespace errors, see the file /home/pjeremy/sage-3.4/tmp/.doctest_fast_eval.py
         [2.9 s]

freebsd/sage-3.4/7.xErrs (last edited 2009-04-03 01:44:27 by PeterJeremy)